overcloud

From Remo, 2 Years ago, written in Plain Text, viewed 262 times.
URL http://pastebin.mattei.co/index.php/view/e41899ef Embed
Download Paste or View Raw
  1. [stack@undercloud ~]$ . stackrc
  2. ^[[A^[[A[stack@undercloud ~]$ openstack stack resource list -n5 overcloud |grep -v COMPLETE
  3. +----------------------------------------------+---------------------------------------------------------------------------------------------------+-------------------------------------------------------------------------------------------------------------------------+-----------------+----------------------+---------------------------------------------------------------------------------------------------------------------------------------+
  4. | resource_name                                | physical_resource_id                                                                              | resource_type                                                                                                           | resource_status | updated_time         | stack_name                                                                                                                            |
  5. +----------------------------------------------+---------------------------------------------------------------------------------------------------+-------------------------------------------------------------------------------------------------------------------------+-----------------+----------------------+---------------------------------------------------------------------------------------------------------------------------------------+
  6. | AllNodesDeploySteps                          | 8389101d-1caf-45a3-a02f-503bf09dae00                                                              | OS::TripleO::PostDeploySteps                                                                                            | CREATE_FAILED   | 2017-08-14T21:57:07Z | overcloud                                                                                                                             |
  7. | ControllerDeployment_Step5                   | 38fc1b37-e8b2-4416-8298-d7da95b2ee0f                                                              | OS::Heat::StructuredDeploymentGroup                                                                                     | CREATE_FAILED   | 2017-08-14T22:53:58Z | overcloud-AllNodesDeploySteps-elsrem5atlid                                                                                            |
  8. | 0                                            | 7e6055c8-25fc-44b8-b5bc-d264d226de2a                                                              | OS::Heat::StructuredDeployment                                                                                          | CREATE_FAILED   | 2017-08-14T23:15:16Z | overcloud-AllNodesDeploySteps-elsrem5atlid-ControllerDeployment_Step5-hgj3qiohcbo3                                                    |
  9. +----------------------------------------------+---------------------------------------------------------------------------------------------------+-------------------------------------------------------------------------------------------------------------------------+-----------------+----------------------+---------------------------------------------------------------------------------------------------------------------------------------+
  10. [stack@undercloud ~]$ openstack stack resource show overcloud-AllNodesDeploySteps-elsrem5atlid-ControllerDeployment_Step5-hgj3qiohcbo3 0
  11. +------------------------+--------------------------------------------------------------------------------------------------------------------------------------------------------------------------------------------------------------------------------------------------------------------+
  12. | Field                  | Value                                                                                                                                                                                                                                                              |
  13. +------------------------+--------------------------------------------------------------------------------------------------------------------------------------------------------------------------------------------------------------------------------------------------------------------+
  14. | attributes             | {u'deploy_stdout': None, u'deploy_stderr': None, u'deploy_status_code': None}                                                                                                                                                                                      |
  15. | creation_time          | 2017-08-14T23:15:16Z                                                                                                                                                                                                                                               |
  16. | description            |                                                                                                                                                                                                                                                                    |
  17. | links                  | [{u'href': u'http://172.16.200.10:8004/v1/de6b9d33aefc4535b2971cc86e5208ab/stacks/overcloud-AllNodesDeploySteps-elsrem5atlid-ControllerDeployment_Step5-hgj3qiohcbo3/38fc1b37-e8b2-4416-8298-d7da95b2ee0f/resources/0', u'rel': u'self'}, {u'href':                |
  18. |                        | u'http://172.16.200.10:8004/v1/de6b9d33aefc4535b2971cc86e5208ab/stacks/overcloud-AllNodesDeploySteps-elsrem5atlid-ControllerDeployment_Step5-hgj3qiohcbo3/38fc1b37-e8b2-4416-8298-d7da95b2ee0f', u'rel': u'stack'}]                                                |
  19. | logical_resource_id    | 0                                                                                                                                                                                                                                                                  |
  20. | parent_resource        | ControllerDeployment_Step5                                                                                                                                                                                                                                         |
  21. | physical_resource_id   | 7e6055c8-25fc-44b8-b5bc-d264d226de2a                                                                                                                                                                                                                               |
  22. | required_by            | []                                                                                                                                                                                                                                                                 |
  23. | resource_name          | 0                                                                                                                                                                                                                                                                  |
  24. | resource_status        | CREATE_FAILED                                                                                                                                                                                                                                                      |
  25. | resource_status_reason | Error: resources[0]: Deployment to server failed: deploy_status_code : Deployment exited with non-zero status code: 6                                                                                                                                              |
  26. | resource_type          | OS::Heat::StructuredDeployment                                                                                                                                                                                                                                     |
  27. | updated_time           | 2017-08-14T23:15:16Z                                                                                                                                                                                                                                               |
  28. +------------------------+--------------------------------------------------------------------------------------------------------------------------------------------------------------------------------------------------------------------------------------------------------------------+
  29. [stack@undercloud ~]$ openstack software deployment show 7e6055c8-25fc-44b8-b5bc-d264d226de2a --long
  30. +---------------+-----------------------------------------------------------------------------------------------------------------------------------------------------------------------------------------------------------------------------------------------------------------------------+
  31. | Field         | Value                                                                                                                                                                                                                                                                       |
  32. +---------------+-----------------------------------------------------------------------------------------------------------------------------------------------------------------------------------------------------------------------------------------------------------------------------+
  33. | id            | 7e6055c8-25fc-44b8-b5bc-d264d226de2a                                                                                                                                                                                                                                        |
  34. | server_id     | e05dca46-3de4-4eb2-9501-11614dc8abc7                                                                                                                                                                                                                                        |
  35. | config_id     | fd68cb6c-4390-47a4-9b48-65074d7c3890                                                                                                                                                                                                                                        |
  36. | creation_time | 2017-08-14T23:15:22Z                                                                                                                                                                                                                                                        |
  37. | updated_time  | 2017-08-14T23:23:29Z                                                                                                                                                                                                                                                        |
  38. | status        | FAILED                                                                                                                                                                                                                                                                      |
  39. | status_reason | deploy_status_code : Deployment exited with non-zero status code: 6                                                                                                                                                                                                         |
  40. | input_values  | {u'step': 5, u'update_identifier': u'1502747804'}                                                                                                                                                                                                                           |
  41. | action        | CREATE                                                                                                                                                                                                                                                                      |
  42. | output_values | {u'deploy_stdout': u"\x1b[mNotice: hiera(): Cannot load backend module_data: cannot load such file -- hiera/backend/module_data_backend\x1b[0m\n\x1b[mNotice: Scope(Class[Tripleo::Firewall::Post]): At this stage, all network traffic is blocked.\x1b[0m\n\x1b[mNotice:   |
  43. |               | Compiled catalog for os-lab-controller-0.localdomain in environment production in 19.24 seconds\x1b[0m\n\x1b[mNotice: /Stage[main]/Main/Package_manifest[/var/lib/tripleo/installed-packages/overcloud_controller5]/ensure: created\x1b[0m\n\x1b[mNotice:                   |
  44. |               | /Stage[main]/Heat::Cron::Purge_deleted/Cron[heat-manage purge_deleted]/ensure: created\x1b[0m\n\x1b[mNotice: /Stage[main]/Tripleo::Profile::Pacemaker::Database::Mysql/Exec[galera-set-root-password]/returns: executed successfully\x1b[0m\n\x1b[mNotice:                  |
  45. |               | /Stage[main]/Tripleo::Profile::Pacemaker::Database::Mysql/File[/root/.my.cnf]/content: content changed '{md5}d41d8cd98f00b204e9800998ecf8427e' to '{md5}1c19218d82253dce877a864903ea872f'\x1b[0m\n\x1b[mNotice:                                                             |
  46. |               | /Stage[main]/Tripleo::Profile::Pacemaker::Database::Mysql/File[/root/.my.cnf]/mode: mode changed '0644' to '0600'\x1b[0m\n\x1b[mNotice: /Stage[main]/Tripleo::Profile::Pacemaker::Database::Mysql/File[/root/.my.cnf]/seltype: seltype changed 'admin_home_t' to            |
  47. |               | 'mysqld_home_t'\x1b[0m\n\x1b[mNotice: /Stage[main]/Tripleo::Profile::Base::Database::Mysql::Client/Exec[directory-create-etc-my.cnf.d]/returns: executed successfully\x1b[0m\n\x1b[mNotice:                                                                                 |
  48. |               | /Stage[main]/Neutron::Agents::Ml2::Ovs/Neutron_agent_ovs[ovs/bridge_mappings]/ensure: created\x1b[0m\n\x1b[mNotice: /Stage[main]/Neutron::Agents::Ml2::Ovs/Neutron_agent_ovs[agent/l2_population]/ensure: created\x1b[0m\n\x1b[mNotice:                                     |
  49. |               | /Stage[main]/Neutron::Agents::Ml2::Ovs/Neutron_agent_ovs[agent/arp_responder]/ensure: created\x1b[0m\n\x1b[mNotice: /Stage[main]/Neutron::Agents::Ml2::Ovs/Neutron_agent_ovs[agent/enable_distributed_routing]/ensure: created\x1b[0m\n\x1b[mNotice:                        |
  50. |               | /Stage[main]/Neutron::Agents::Ml2::Ovs/Neutron_agent_ovs[agent/drop_flows_on_start]/ensure: created\x1b[0m\n\x1b[mNotice: /Stage[main]/Neutron::Agents::Ml2::Ovs/Neutron_agent_ovs[agent/extensions]/ensure: created\x1b[0m\n\x1b[mNotice:                                  |
  51. |               | /Stage[main]/Neutron::Agents::Ml2::Ovs/Neutron_agent_ovs[ovs/integration_bridge]/ensure: created\x1b[0m\n\x1b[mNotice: /Stage[main]/Neutron::Agents::Ml2::Ovs/Neutron_agent_ovs[securitygroup/firewall_driver]/ensure: created\x1b[0m\n\x1b[mNotice:                        |
  52. |               | /Stage[main]/Neutron::Agents::Ml2::Ovs/Neutron_agent_ovs[ovs/tunnel_bridge]/ensure: created\x1b[0m\n\x1b[mNotice: /Stage[main]/Neutron::Agents::Ml2::Ovs/Neutron_agent_ovs[ovs/local_ip]/ensure: created\x1b[0m\n\x1b[mNotice:                                              |
  53. |               | /Stage[main]/Neutron::Agents::Ml2::Ovs/Neutron_agent_ovs[agent/tunnel_types]/ensure: created\x1b[0m\n\x1b[mNotice: /Stage[main]/Neutron::Agents::Ml2::Ovs/Neutron_agent_ovs[agent/vxlan_udp_port]/ensure: created\x1b[0m\n\x1b[mNotice:                                     |
  54. |               | /Stage[main]/Neutron::Agents::Ml2::Ovs/Service[ovs-cleanup-service]/enable: enable changed 'false' to 'true'\x1b[0m\n\x1b[mNotice: /Stage[main]/Tripleo::Profile::Base::Nova/Package[openstack-nova-migration]/ensure: removed\x1b[0m\n\x1b[mNotice:                        |
  55. |               | /Stage[main]/Tripleo::Profile::Base::Swift::Ringbuilder/Exec[create_swift_ring_tarball]/returns: executed successfully\x1b[0m\n\x1b[mNotice: /Stage[main]/Tripleo::Profile::Base::Swift::Ringbuilder/Exec[upload_swift_ring_tarball]: Triggered 'refresh' from 1            |
  56. |               | events\x1b[0m\n\x1b[mNotice: /Stage[main]/Gnocchi::Metricd/Gnocchi_config[metricd/workers]/ensure: created\x1b[0m\n\x1b[mNotice: /Stage[main]/Gnocchi::Statsd/Gnocchi_config[statsd/resource_id]/ensure: created\x1b[0m\n\x1b[mNotice:                                      |
  57. |               | /Stage[main]/Gnocchi::Statsd/Gnocchi_config[statsd/user_id]/ensure: created\x1b[0m\n\x1b[mNotice: /Stage[main]/Gnocchi::Statsd/Gnocchi_config[statsd/project_id]/ensure: created\x1b[0m\n\x1b[mNotice:                                                                      |
  58. |               | /Stage[main]/Gnocchi::Statsd/Gnocchi_config[statsd/archive_policy_name]/ensure: created\x1b[0m\n\x1b[mNotice: /Stage[main]/Gnocchi::Statsd/Gnocchi_config[statsd/flush_delay]/ensure: created\x1b[0m\n\x1b[mNotice:                                                         |
  59. |               | /Stage[main]/Octavia::Health_manager/Octavia_config[health_manager/heartbeat_key]/ensure: created\x1b[0m\n\x1b[mNotice: /Stage[main]/Octavia::Health_manager/Octavia_config[health_manager/event_streamer_driver]/ensure: created\x1b[0m\n\x1b[mNotice:                     |
  60. |               | /Stage[main]/Octavia::Worker/Octavia_config[controller_worker/amp_flavor_id]/ensure: created\x1b[0m\n\x1b[mNotice: /Stage[main]/Octavia::Worker/Octavia_config[controller_worker/amphora_driver]/ensure: created\x1b[0m\n\x1b[mNotice:                                      |
  61. |               | /Stage[main]/Octavia::Worker/Octavia_config[controller_worker/compute_driver]/ensure: created\x1b[0m\n\x1b[mNotice: /Stage[main]/Octavia::Worker/Octavia_config[controller_worker/network_driver]/ensure: created\x1b[0m\n\x1b[mNotice:                                     |
  62. |               | /Stage[main]/Cinder::Cron::Db_purge/Cron[cinder-manage db purge]/ensure: created\x1b[0m\n\x1b[mNotice: /Stage[main]/Tripleo::Profile::Pacemaker::Database::Mysql/Exec[galera-ready]/returns: executed successfully\x1b[0m\n\x1b[mNotice:                                    |
  63. |               | /Stage[main]/Neutron::Deps/Anchor[neutron::config::end]: Triggered 'refresh' from 12 events\x1b[0m\n\x1b[mNotice: /Stage[main]/Neutron::Agents::Ml2::Ovs/Neutron::Plugins::Ovs::Bridge[datacentre:br-ex]/Vs_bridge[br-ex]/external_ids: external_ids changed '' to 'bridge- |
  64. |               | id=br-ex'\x1b[0m\n\x1b[mNotice: /Stage[main]/Gnocchi::Deps/Anchor[gnocchi::config::end]: Triggered 'refresh' from 6 events\x1b[0m\n\x1b[mNotice: /Stage[main]/Octavia::Deps/Anchor[octavia::config::end]: Triggered 'refresh' from 6 events\x1b[0m\n\x1b[mNotice:           |
  65. |               | /Stage[main]/Tripleo::Profile::Pacemaker::Cinder::Volume/Pacemaker::Resource::Service[openstack-cinder-volume]/Pacemaker::Resource::Systemd[openstack-cinder-volume]/Pcmk_resource[openstack-cinder-volume]/ensure: created\x1b[0m\n\x1b[mNotice:                           |
  66. |               | /Stage[main]/Aodh::Db::Mysql/Openstacklib::Db::Mysql[aodh]/Openstacklib::Db::Mysql::Host_access[aodh_overcloud.internalapi.localdomain]/Mysql_grant[aodh@overcloud.internalapi.localdomain/aodh.*]/ensure: created\x1b[0m\n\x1b[mNotice:                                    |
  67. |               | /Stage[main]/Aodh::Deps/Anchor[aodh::db::end]: Triggered 'refresh' from 1 events\x1b[0m\n\x1b[mNotice: /Stage[main]/Aodh::Deps/Anchor[aodh::dbsync::begin]: Triggered 'refresh' from 1 events\x1b[0m\n\x1b[mNotice: /Stage[main]/Aodh::Db::Sync/Exec[aodh-db-sync]:         |
  68. |               | Triggered 'refresh' from 1 events\x1b[0m\n\x1b[mNotice: /Stage[main]/Aodh::Deps/Anchor[aodh::dbsync::end]: Triggered 'refresh' from 1 events\x1b[0m\n\x1b[mNotice: /Stage[main]/Aodh::Deps/Anchor[aodh::service::begin]: Triggered 'refresh' from 1                         |
  69. |               | events\x1b[0m\n\x1b[mNotice: /Stage[main]/Aodh::Api/Service[aodh-api]: Triggered 'refresh' from 1 events\x1b[0m\n\x1b[mNotice: /Stage[main]/Aodh::Evaluator/Service[aodh-evaluator]: Triggered 'refresh' from 1 events\x1b[0m\n\x1b[mNotice:                                |
  70. |               | /Stage[main]/Aodh::Notifier/Service[aodh-notifier]: Triggered 'refresh' from 1 events\x1b[0m\n\x1b[mNotice: /Stage[main]/Aodh::Listener/Service[aodh-listener]: Triggered 'refresh' from 1 events\x1b[0m\n\x1b[mNotice: /Stage[main]/Aodh::Deps/Anchor[aodh::service::end]: |
  71. |               | Triggered 'refresh' from 4 events\x1b[0m\n\x1b[mNotice:                                                                                                                                                                                                                     |
  72. |               | /Stage[main]/Ceilometer::Db::Mysql/Openstacklib::Db::Mysql[ceilometer]/Openstacklib::Db::Mysql::Host_access[ceilometer_overcloud.internalapi.localdomain]/Mysql_grant[ceilometer@overcloud.internalapi.localdomain/ceilometer.*]/ensure: created\x1b[0m\n\x1b[mNotice:      |
  73. |               | /Stage[main]/Ceilometer::Deps/Anchor[ceilometer::db::end]: Triggered 'refresh' from 1 events\x1b[0m\n\x1b[mNotice: /Stage[main]/Ceilometer::Deps/Anchor[ceilometer::dbsync::begin]: Triggered 'refresh' from 1 events\x1b[0m\n\x1b[mNotice:                                 |
  74. |               | /Stage[main]/Ceilometer::Db::Sync/Exec[ceilometer-upgrade]: Triggered 'refresh' from 1 events\x1b[0m\n\x1b[mNotice: /Stage[main]/Ceilometer::Deps/Anchor[ceilometer::dbsync::end]: Triggered 'refresh' from 1 events\x1b[0m\n\x1b[mNotice:                                  |
  75. |               | /Stage[main]/Ceilometer::Deps/Anchor[ceilometer::service::begin]: Triggered 'refresh' from 1 events\x1b[0m\n\x1b[mNotice: /Stage[main]/Ceilometer::Api/Service[ceilometer-api]: Triggered 'refresh' from 1 events\x1b[0m\n\x1b[mNotice:                                     |
  76. |               | /Stage[main]/Ceilometer::Collector/Service[ceilometer-collector]: Triggered 'refresh' from 1 events\x1b[0m\n\x1b[mNotice: /Stage[main]/Ceilometer::Agent::Central/Service[ceilometer-agent-central]: Triggered 'refresh' from 1 events\x1b[0m\n\x1b[mNotice:                |
  77. |               | /Stage[main]/Ceilometer::Agent::Notification/Service[ceilometer-agent-notification]: Triggered 'refresh' from 1 events\x1b[0m\n\x1b[mNotice: /Stage[main]/Ceilometer::Deps/Anchor[ceilometer::service::end]: Triggered 'refresh' from 4 events\x1b[0m\n\x1b[mNotice:        |
  78. |               | /Stage[main]/Cinder::Db::Mysql/Openstacklib::Db::Mysql[cinder]/Openstacklib::Db::Mysql::Host_access[cinder_overcloud.internalapi.localdomain]/Mysql_grant[cinder@overcloud.internalapi.localdomain/cinder.*]/ensure: created\x1b[0m\n\x1b[mNotice:                          |
  79. |               | /Stage[main]/Cinder::Deps/Anchor[cinder::db::end]: Triggered 'refresh' from 1 events\x1b[0m\n\x1b[mNotice: /Stage[main]/Cinder::Deps/Anchor[cinder::dbsync::begin]: Triggered 'refresh' from 1 events\x1b[0m\n\x1b[mNotice: /Stage[main]/Cinder::Db::Sync/Exec[cinder-      |
  80. |               | manage db_sync]: Triggered 'refresh' from 1 events\x1b[0m\n\x1b[mNotice: /Stage[main]/Cinder::Deps/Anchor[cinder::dbsync::end]: Triggered 'refresh' from 1 events\x1b[0m\n\x1b[mNotice: /Stage[main]/Cinder::Deps/Anchor[cinder::service::begin]: Triggered 'refresh' from  |
  81. |               | 1 events\x1b[0m\n\x1b[mNotice: /Stage[main]/Cinder::Api/Service[cinder-api]: Triggered 'refresh' from 1 events\x1b[0m\n\x1b[mNotice: /Stage[main]/Cinder::Scheduler/Service[cinder-scheduler]: Triggered 'refresh' from 1 events\x1b[0m\n\x1b[mNotice:                      |
  82. |               | /Stage[main]/Cinder::Volume/Service[cinder-volume]: Triggered 'refresh' from 1 events\x1b[0m\n\x1b[mNotice:                                                                                                                                                                 |
  83. |               | /Stage[main]/Glance::Db::Mysql/Openstacklib::Db::Mysql[glance]/Openstacklib::Db::Mysql::Host_access[glance_overcloud.internalapi.localdomain]/Mysql_grant[glance@overcloud.internalapi.localdomain/glance.*]/ensure: created\x1b[0m\n\x1b[mNotice:                          |
  84. |               | /Stage[main]/Glance::Deps/Anchor[glance::db::end]: Triggered 'refresh' from 1 events\x1b[0m\n\x1b[mNotice: /Stage[main]/Glance::Deps/Anchor[glance::dbsync::begin]: Triggered 'refresh' from 1 events\x1b[0m\n\x1b[mNotice: /Stage[main]/Glance::Db::Sync/Exec[glance-      |
  85. |               | manage db_sync]: Triggered 'refresh' from 1 events\x1b[0m\n\x1b[mNotice: /Stage[main]/Glance::Deps/Anchor[glance::dbsync::end]: Triggered 'refresh' from 1 events\x1b[0m\n\x1b[mNotice: /Stage[main]/Glance::Deps/Anchor[glance::service::begin]: Triggered 'refresh' from  |
  86. |               | 1 events\x1b[0m\n\x1b[mNotice: /Stage[main]/Glance::Db::Metadefs/Exec[glance-manage db_load_metadefs]: Triggered 'refresh' from 1 events\x1b[0m\n\x1b[mNotice:                                                                                                              |
  87. |               | /Stage[main]/Gnocchi::Db::Mysql/Openstacklib::Db::Mysql[gnocchi]/Openstacklib::Db::Mysql::Host_access[gnocchi_overcloud.internalapi.localdomain]/Mysql_grant[gnocchi@overcloud.internalapi.localdomain/gnocchi.*]/ensure: created\x1b[0m\n\x1b[mNotice:                     |
  88. |               | /Stage[main]/Gnocchi::Deps/Anchor[gnocchi::db::end]: Triggered 'refresh' from 1 events\x1b[0m\n\x1b[mNotice: /Stage[main]/Gnocchi::Deps/Anchor[gnocchi::dbsync::begin]: Triggered 'refresh' from 1 events\x1b[0m\n\x1b[mNotice:                                             |
  89. |               | /Stage[main]/Heat::Db::Mysql/Openstacklib::Db::Mysql[heat]/Openstacklib::Db::Mysql::Host_access[heat_overcloud.internalapi.localdomain]/Mysql_grant[heat@overcloud.internalapi.localdomain/heat.*]/ensure: created\x1b[0m\n\x1b[mNotice:                                    |
  90. |               | /Stage[main]/Heat::Deps/Anchor[heat::db::end]: Triggered 'refresh' from 1 events\x1b[0m\n\x1b[mNotice: /Stage[main]/Heat::Deps/Anchor[heat::dbsync::begin]: Triggered 'refresh' from 1 events\x1b[0m\n\x1b[mNotice: /Stage[main]/Heat::Db::Sync/Exec[heat-dbsync]:          |
  91. |               | Triggered 'refresh' from 1 events\x1b[0m\n\x1b[mNotice: /Stage[main]/Heat::Deps/Anchor[heat::dbsync::end]: Triggered 'refresh' from 1 events\x1b[0m\n\x1b[mNotice: /Stage[main]/Heat::Deps/Anchor[heat::service::begin]: Triggered 'refresh' from 1                         |
  92. |               | events\x1b[0m\n\x1b[mNotice: /Stage[main]/Heat::Api/Service[heat-api]: Triggered 'refresh' from 1 events\x1b[0m\n\x1b[mNotice: /Stage[main]/Heat::Api_cfn/Service[heat-api-cfn]: Triggered 'refresh' from 1 events\x1b[0m\n\x1b[mNotice:                                    |
  93. |               | /Stage[main]/Heat::Api_cloudwatch/Service[heat-api-cloudwatch]: Triggered 'refresh' from 1 events\x1b[0m\n\x1b[mNotice: /Stage[main]/Heat::Engine/Service[heat-engine]: Triggered 'refresh' from 1 events\x1b[0m\n\x1b[mNotice:                                             |
  94. |               | /Stage[main]/Heat::Deps/Anchor[heat::service::end]: Triggered 'refresh' from 4 events\x1b[0m\n\x1b[mNotice:                                                                                                                                                                 |
  95. |               | /Stage[main]/Neutron::Db::Mysql/Openstacklib::Db::Mysql[neutron]/Openstacklib::Db::Mysql::Host_access[ovs_neutron_overcloud.internalapi.localdomain]/Mysql_grant[neutron@overcloud.internalapi.localdomain/ovs_neutron.*]/ensure: created\x1b[0m\n\x1b[mNotice:             |
  96. |               | /Stage[main]/Neutron::Deps/Anchor[neutron::db::end]: Triggered 'refresh' from 1 events\x1b[0m\n\x1b[mNotice: /Stage[main]/Neutron::Deps/Anchor[neutron::dbsync::begin]: Triggered 'refresh' from 1 events\x1b[0m\n\x1b[mNotice: /Stage[main]/Neutron::Db::Sync/Exec         |
  97. |               | [neutron-db-sync]: Triggered 'refresh' from 2 events\x1b[0m\n\x1b[mNotice: /Stage[main]/Neutron::Deps/Anchor[neutron::dbsync::end]: Triggered 'refresh' from 1 events\x1b[0m\n\x1b[mNotice: /Stage[main]/Neutron::Deps/Anchor[neutron::service::begin]: Triggered 'refresh' |
  98. |               | from 2 events\x1b[0m\n\x1b[mNotice: /Stage[main]/Neutron::Agents::Dhcp/Service[neutron-dhcp-service]: Triggered 'refresh' from 1 events\x1b[0m\n\x1b[mNotice: /Stage[main]/Neutron::Server/Service[neutron-server]: Triggered 'refresh' from 1 events\x1b[0m\n\x1b[mNotice: |
  99. |               | /Stage[main]/Neutron::Agents::L3/Service[neutron-l3]: Triggered 'refresh' from 1 events\x1b[0m\n\x1b[mNotice: /Stage[main]/Neutron::Agents::Metadata/Service[neutron-metadata]: Triggered 'refresh' from 1 events\x1b[0m\n\x1b[mNotice:                                     |
  100. |               | /Stage[main]/Neutron::Agents::Ml2::Ovs/Service[neutron-ovs-agent-service]/ensure: ensure changed 'stopped' to 'running'\x1b[0m\n\x1b[mNotice: /Stage[main]/Neutron::Deps/Anchor[neutron::service::end]: Triggered 'refresh' from 5 events\x1b[0m\n\x1b[mNotice:             |
  101. |               | /Stage[main]/Nova::Db::Mysql/Openstacklib::Db::Mysql[nova]/Openstacklib::Db::Mysql::Host_access[nova_overcloud.internalapi.localdomain]/Mysql_grant[nova@overcloud.internalapi.localdomain/nova.*]/ensure: created\x1b[0m\n\x1b[mNotice:                                    |
  102. |               | /Stage[main]/Nova::Db::Mysql/Openstacklib::Db::Mysql[nova_cell0]/Openstacklib::Db::Mysql::Host_access[nova_cell0_overcloud.internalapi.localdomain]/Mysql_grant[nova@overcloud.internalapi.localdomain/nova_cell0.*]/ensure: created\x1b[0m\n\x1b[mNotice:                  |
  103. |               | /Stage[main]/Nova::Db::Mysql_api/Openstacklib::Db::Mysql[nova_api]/Openstacklib::Db::Mysql::Host_access[nova_api_overcloud.internalapi.localdomain]/Mysql_grant[nova_api@overcloud.internalapi.localdomain/nova_api.*]/ensure: created\x1b[0m\n\x1b[mNotice:                |
  104. |               | /Stage[main]/Nova::Db::Mysql_placement/Openstacklib::Db::Mysql[nova_placement]/Openstacklib::Db::Mysql::Host_access[nova_placement_overcloud.internalapi.localdomain]/Mysql_grant[nova_placement@overcloud.internalapi.localdomain/nova_placement.*]/ensure:                |
  105. |               | created\x1b[0m\n\x1b[mNotice: /Stage[main]/Nova::Deps/Anchor[nova::db::end]: Triggered 'refresh' from 3 events\x1b[0m\n\x1b[mNotice: /Stage[main]/Nova::Deps/Anchor[nova::dbsync_api::begin]: Triggered 'refresh' from 1 events\x1b[0m\n\x1b[mNotice:                       |
  106. |               | /Stage[main]/Nova::Db::Sync_api/Exec[nova-db-sync-api]: Triggered 'refresh' from 2 events\x1b[0m\n\x1b[mNotice: /Stage[main]/Nova::Deps/Anchor[nova::dbsync_api::end]: Triggered 'refresh' from 1 events\x1b[0m\n\x1b[mNotice:                                              |
  107. |               | /Stage[main]/Nova::Deps/Anchor[nova::cell_v2::begin]: Triggered 'refresh' from 1 events\x1b[0m\n\x1b[mNotice: /Stage[main]/Nova::Deps/Anchor[nova::db_online_data_migrations::begin]: Triggered 'refresh' from 1 events\x1b[0m\n\x1b[mNotice:                               |
  108. |               | /Stage[main]/Nova::Cell_v2::Map_cell0/Exec[nova-cell_v2-map_cell0]: Triggered 'refresh' from 1 events\x1b[0m\n\x1b[mNotice: /Stage[main]/Nova::Deps/Anchor[nova::cell_v2::end]: Triggered 'refresh' from 1 events\x1b[0m\n\x1b[mNotice:                                     |
  109. |               | /Stage[main]/Nova::Deps/Anchor[nova::dbsync::begin]: Triggered 'refresh' from 3 events\x1b[0m\n\x1b[mNotice: /Stage[main]/Nova::Db::Sync/Exec[nova-db-sync]: Triggered 'refresh' from 2 events\x1b[0m\n\x1b[mNotice: /Stage[main]/Nova::Deps/Anchor[nova::dbsync::end]:     |
  110. |               | Triggered 'refresh' from 1 events\x1b[0m\n\x1b[mNotice: /Stage[main]/Nova::Deps/Anchor[nova::service::begin]: Triggered 'refresh' from 3 events\x1b[0m\n\x1b[mNotice: /Stage[main]/Nova::Cron::Archive_deleted_rows/Cron[nova-manage db archive_deleted_rows]/ensure:       |
  111. |               | created\x1b[0m\n\x1b[mNotice: /Stage[main]/Nova::Conductor/Nova::Generic_service[conductor]/Service[nova-conductor]: Triggered 'refresh' from 1 events\x1b[0m\n\x1b[mNotice: /Stage[main]/Nova::Api/Nova::Generic_service[api]/Service[nova-api]: Triggered 'refresh' from  |
  112. |               | 1 events\x1b[0m\n\x1b[mNotice: /Stage[main]/Nova::Scheduler/Nova::Generic_service[scheduler]/Service[nova-scheduler]: Triggered 'refresh' from 1 events\x1b[0m\n\x1b[mNotice: /Stage[main]/Nova::Consoleauth/Nova::Generic_service[consoleauth]/Service[nova-consoleauth]:  |
  113. |               | Triggered 'refresh' from 1 events\x1b[0m\n\x1b[mNotice: /Stage[main]/Nova::Vncproxy/Nova::Generic_service[vncproxy]/Service[nova-vncproxy]: Triggered 'refresh' from 1 events\x1b[0m\n\x1b[mNotice: /Stage[main]/Nova::Deps/Anchor[nova::service::end]: Triggered 'refresh' |
  114. |               | from 5 events\x1b[0m\n\x1b[mNotice: /Stage[main]/Nova::Cell_v2::Discover_hosts/Exec[nova-cell_v2-discover_hosts]/returns: executed successfully\x1b[0m\n\x1b[mNotice: /Stage[main]/Nova::Cell_v2::Discover_hosts/Exec[nova-cell_v2-discover_hosts]: Triggered 'refresh'     |
  115. |               | from 1 events\x1b[0m\n\x1b[mNotice: /Stage[main]/Panko::Db::Mysql/Openstacklib::Db::Mysql[panko]/Openstacklib::Db::Mysql::Host_access[panko_overcloud.internalapi.localdomain]/Mysql_grant[panko@overcloud.internalapi.localdomain/panko.*]/ensure:                         |
  116. |               | created\x1b[0m\n\x1b[mNotice: /Stage[main]/Panko::Deps/Anchor[panko::db::end]: Triggered 'refresh' from 1 events\x1b[0m\n\x1b[mNotice: /Stage[main]/Panko::Deps/Anchor[panko::dbsync::begin]: Triggered 'refresh' from 1 events\x1b[0m\n\x1b[mNotice:                       |
  117. |               | /Stage[main]/Panko::Db::Sync/Exec[panko-db-sync]: Triggered 'refresh' from 1 events\x1b[0m\n\x1b[mNotice: /Stage[main]/Panko::Deps/Anchor[panko::dbsync::end]: Triggered 'refresh' from 1 events\x1b[0m\n\x1b[mNotice:                                                      |
  118. |               | /Stage[main]/Panko::Deps/Anchor[panko::service::begin]: Triggered 'refresh' from 1 events\x1b[0m\n\x1b[mNotice: /Stage[main]/Panko::Api/Service[panko-api]: Triggered 'refresh' from 1 events\x1b[0m\n\x1b[mNotice: /Stage[main]/Panko::Deps/Anchor[panko::service::end]:   |
  119. |               | Triggered 'refresh' from 1 events\x1b[0m\n\x1b[mNotice: /Stage[main]/Cinder::Deps/Anchor[cinder::service::end]: Triggered 'refresh' from 3 events\x1b[0m\n\x1b[mNotice:                                                                                                     |
  120. |               | /Stage[main]/Octavia::Db::Mysql/Openstacklib::Db::Mysql[octavia]/Openstacklib::Db::Mysql::Host_access[octavia_overcloud.internalapi.localdomain]/Mysql_grant[octavia@overcloud.internalapi.localdomain/octavia.*]/ensure: created\x1b[0m\n\x1b[mNotice:                     |
  121. |               | /Stage[main]/Octavia::Deps/Anchor[octavia::db::end]: Triggered 'refresh' from 1 events\x1b[0m\n\x1b[mNotice: /Stage[main]/Octavia::Deps/Anchor[octavia::dbsync::begin]: Triggered 'refresh' from 1 events\x1b[0m\n\x1b[mNotice: /Stage[main]/Octavia::Db::Sync/Exec         |
  122. |               | [octavia-db-sync]: Triggered 'refresh' from 2 events\x1b[0m\n\x1b[mNotice: /Stage[main]/Octavia::Deps/Anchor[octavia::dbsync::end]: Triggered 'refresh' from 1 events\x1b[0m\n\x1b[mNotice: /Stage[main]/Octavia::Deps/Anchor[octavia::service::begin]: Triggered 'refresh' |
  123. |               | from 2 events\x1b[0m\n\x1b[mNotice: /Stage[main]/Octavia::Api/Service[octavia-api]: Triggered 'refresh' from 1 events\x1b[0m\n\x1b[mNotice: /Stage[main]/Octavia::Health_manager/Service[octavia-health-manager]/ensure: ensure changed 'stopped' to                        |
  124. |               | 'running'\x1b[0m\n\x1b[mNotice: /Stage[main]/Octavia::Housekeeping/Service[octavia-housekeeping]/ensure: ensure changed 'stopped' to 'running'\x1b[0m\n\x1b[mNotice: /Stage[main]/Octavia::Worker/Service[octavia-worker]/ensure: ensure changed 'stopped' to               |
  125. |               | 'running'\x1b[0m\n\x1b[mNotice: /Stage[main]/Octavia::Deps/Anchor[octavia::service::end]: Triggered 'refresh' from 4 events\x1b[0m\n\x1b[mNotice: /Stage[main]/Glance::Api/Service[glance-api]: Triggered 'refresh' from 1 events\x1b[0m\n\x1b[mNotice:                     |
  126. |               | /Stage[main]/Glance::Deps/Anchor[glance::service::end]: Triggered 'refresh' from 1 events\x1b[0m\n\x1b[mNotice: /Stage[main]/Gnocchi::Db::Sync/Exec[gnocchi-db-sync]: Triggered 'refresh' from 2 events\x1b[0m\n\x1b[mNotice:                                               |
  127. |               | /Stage[main]/Gnocchi::Deps/Anchor[gnocchi::dbsync::end]: Triggered 'refresh' from 1 events\x1b[0m\n\x1b[mNotice: /Stage[main]/Gnocchi::Deps/Anchor[gnocchi::service::begin]: Triggered 'refresh' from 2 events\x1b[0m\n\x1b[mNotice: /Stage[main]/Gnocchi::Api/Service      |
  128. |               | [gnocchi-api]: Triggered 'refresh' from 1 events\x1b[0m\n\x1b[mNotice: /Stage[main]/Gnocchi::Metricd/Service[gnocchi-metricd]/ensure: ensure changed 'stopped' to 'running'\x1b[0m\n\x1b[mNotice: /Stage[main]/Gnocchi::Statsd/Service[gnocchi-statsd]/ensure: ensure       |
  129. |               | changed 'stopped' to 'running'\x1b[0m\n\x1b[mNotice:                                                                                                                                                                                                                        |
  130. |               | /Stage[main]/Keystone::Db::Mysql/Openstacklib::Db::Mysql[keystone]/Openstacklib::Db::Mysql::Host_access[keystone_overcloud.internalapi.localdomain]/Mysql_grant[keystone@overcloud.internalapi.localdomain/keystone.*]/ensure: created\x1b[0m\n\x1b[mNotice:                |
  131. |               | /Stage[main]/Keystone::Deps/Anchor[keystone::db::end]: Triggered 'refresh' from 1 events\x1b[0m\n\x1b[mNotice: /Stage[main]/Keystone::Deps/Anchor[keystone::dbsync::begin]: Triggered 'refresh' from 1 events\x1b[0m\n\x1b[mNotice: /Stage[main]/Keystone::Db::Sync/Exec    |
  132. |               | [keystone-manage db_sync]: Triggered 'refresh' from 1 events\x1b[0m\n\x1b[mNotice: /Stage[main]/Keystone::Deps/Anchor[keystone::dbsync::end]: Triggered 'refresh' from 1 events\x1b[0m\n\x1b[mNotice: /Stage[main]/Keystone/Exec[keystone-manage bootstrap]: Triggered      |
  133. |               | 'refresh' from 1 events\x1b[0m\n\x1b[mNotice: /Stage[main]/Keystone::Deps/Anchor[keystone::service::begin]: Triggered 'refresh' from 2 events\x1b[0m\n\x1b[mNotice: /Stage[main]/Apache::Service/Service[httpd]: Triggered 'refresh' from 1 events\x1b[0m\n\x1b[mNotice:    |
  134. |               | /Stage[main]/Gnocchi::Deps/Anchor[gnocchi::service::end]: Triggered 'refresh' from 4 events\x1b[0m\n\x1b[mNotice: Applied catalog in 438.24 seconds\x1b[0m\n", u'deploy_stderr': u'exception: connect failed\n\x1b[1;33mWarning: ModuleLoader: module \'openstacklib\' has  |
  135. |               | unresolved dependencies - it will only see those that are resolved. Use \'puppet module list --tree\' to see information about modules\n   (file & line not available)\x1b[0m\n\x1b[1;33mWarning: This method is deprecated, please use the stdlib validate_legacy          |
  136. |               | function, with Pattern[]. There is further documentation for validate_legacy function in the README. at ["/var/lib/heat-config/heat-config-puppet/fd68cb6c-4390-47a4-9b48-65074d7c3890.pp", 37]:["/etc/puppet/modules/tripleo/manifests/profile/base/cinder/api.pp", 73]\n  |
  137. |               | (at /etc/puppet/modules/stdlib/lib/puppet/functions/deprecation.rb:25:in `deprecation\')\x1b[0m\n\x1b[1;33mWarning: Scope(Class[Cinder]): host is deprecated, has no effect and will be removed in a future release, use backend_host instead\x1b[0m\n\x1b[1;33mWarning:    |
  138. |               | Scope(Class[Cinder]): cinder::rabbit_host, cinder::rabbit_hosts, cinder::rabbit_password, cinder::rabbit_port, cinder::rabbit_userid and cinder::rabbit_virtual_host are deprecated. Please use cinder::default_transport_url instead.\x1b[0m\n\x1b[1;33mWarning: This      |
  139. |               | method is deprecated, please use the stdlib validate_legacy function, with Stdlib::Compat::Hash. There is further documentation for validate_legacy function in the README. at ["/var/lib/heat-config/heat-config-puppet/fd68cb6c-4390-47a4-9b48-65074d7c3890.pp",          |
  140. |               | 37]:["/etc/puppet/modules/tripleo/manifests/profile/base/cinder/api.pp", 73]\n   (at /etc/puppet/modules/stdlib/lib/puppet/functions/deprecation.rb:25:in `deprecation\')\x1b[0m\n\x1b[1;33mWarning: This method is deprecated, please use the stdlib validate_legacy       |
  141. |               | function, with Stdlib::Compat::Bool. There is further documentation for validate_legacy function in the README. at ["/var/lib/heat-config/heat-config-puppet/fd68cb6c-4390-47a4-9b48-65074d7c3890.pp",                                                                      |
  142. |               | 37]:["/etc/puppet/modules/tripleo/manifests/profile/base/cinder/api.pp", 91]\n   (at /etc/puppet/modules/stdlib/lib/puppet/functions/deprecation.rb:25:in `deprecation\')\x1b[0m\n\x1b[1;33mWarning: This method is deprecated, please use match expressions with           |
  143. |               | Stdlib::Compat::Array instead. They are described at https://docs.puppet.com/puppet/latest/reference/lang_data_type.html#match-expressions. at ["/var/lib/heat-config/heat-config-puppet/fd68cb6c-4390-47a4-9b48-65074d7c3890.pp",                                          |
  144. |               | 37]:["/etc/puppet/modules/tripleo/manifests/profile/base/cinder/api.pp", 92]\n   (at /etc/puppet/modules/stdlib/lib/puppet/functions/deprecation.rb:25:in `deprecation\')\x1b[0m\n\x1b[1;33mWarning: This method is deprecated, please use the stdlib validate_legacy       |
  145. |               | function, with Stdlib::Compat::Array. There is further documentation for validate_legacy function in the README. at ["/var/lib/heat-config/heat-config-puppet/fd68cb6c-4390-47a4-9b48-65074d7c3890.pp",                                                                     |
  146. |               | 37]:["/etc/puppet/modules/tripleo/manifests/profile/base/cinder/api.pp", 92]\n   (at /etc/puppet/modules/stdlib/lib/puppet/functions/deprecation.rb:25:in `deprecation\')\x1b[0m\n\x1b[1;33mWarning: This method is deprecated, please use match expressions with           |
  147. |               | Stdlib::Compat::String instead. They are described at https://docs.puppet.com/puppet/latest/reference/lang_data_type.html#match-expressions. at ["/var/lib/heat-config/heat-config-puppet/fd68cb6c-4390-47a4-9b48-65074d7c3890.pp",                                         |
  148. |               | 37]:["/etc/puppet/modules/tripleo/manifests/profile/base/cinder/api.pp", 92]\n   (at /etc/puppet/modules/stdlib/lib/puppet/functions/deprecation.rb:25:in `deprecation\')\x1b[0m\n\x1b[1;33mWarning: This method is deprecated, please use match expressions with           |
  149. |               | Stdlib::Compat::Bool instead. They are described at https://docs.puppet.com/puppet/latest/reference/lang_data_type.html#match-expressions. at ["/var/lib/heat-config/heat-config-puppet/fd68cb6c-4390-47a4-9b48-65074d7c3890.pp",                                           |
  150. |               | 37]:["/etc/puppet/modules/tripleo/manifests/profile/base/cinder/api.pp", 92]\n   (at /etc/puppet/modules/stdlib/lib/puppet/functions/deprecation.rb:25:in `deprecation\')\x1b[0m\n\x1b[1;33mWarning: Unknown variable: \'ensure\'. at                                       |
  151. |               | /etc/puppet/modules/cinder/manifests/volume.pp:64:18\x1b[0m\n\x1b[1;33mWarning: Scope(Class[Keystone]): keystone::rabbit_host, keystone::rabbit_hosts, keystone::rabbit_password, keystone::rabbit_port, keystone::rabbit_userid and keystone::rabbit_virtual_host are      |
  152. |               | deprecated. Please use keystone::default_transport_url instead.\x1b[0m\n\x1b[1;33mWarning: This method is deprecated, please use the stdlib validate_legacy function, with Stdlib::Compat::String. There is further documentation for validate_legacy function in the       |
  153. |               | README. at ["/var/lib/heat-config/heat-config-puppet/fd68cb6c-4390-47a4-9b48-65074d7c3890.pp", 49]:\n   (at /etc/puppet/modules/stdlib/lib/puppet/functions/deprecation.rb:25:in `deprecation\')\x1b[0m\n\x1b[1;33mWarning: Unknown variable: \'default_store_real\'. at    |
  154. |               | /etc/puppet/modules/glance/manifests/api.pp:401:9\x1b[0m\n\x1b[1;33mWarning: Scope(Class[Glance::Api]): default_store not provided, it will be automatically set to glance.store.http.Store\x1b[0m\n\x1b[1;33mWarning: Scope(Class[Glance::Notify::Rabbitmq]):              |
  155. |               | glance::notify::rabbitmq::rabbit_host, glance::notify::rabbitmq::rabbit_hosts, glance::notify::rabbitmq::rabbit_password, glance::notify::rabbitmq::rabbit_port, glance::notify::rabbitmq::rabbit_userid and glance::notify::rabbitmq::rabbit_virtual_host are deprecated.  |
  156. |               | Please use glance::notify::rabbitmq::default_transport_url instead.\x1b[0m\n\x1b[1;33mWarning: Unknown variable: \'::swift::client_package_ensure\'. at /etc/puppet/modules/swift/manifests/client.pp:12:13\x1b[0m\n\x1b[1;33mWarning: ModuleLoader: module \'swift\' has   |
  157. |               | unresolved dependencies - it will only see those that are resolved. Use \'puppet module list --tree\' to see information about modules\n   (file & line not available)\x1b[0m\n\x1b[1;33mWarning: Scope(Class[Heat]): heat::rabbit_host, heat::rabbit_hosts,                |
  158. |               | heat::rabbit_password, heat::rabbit_port, heat::rabbit_userid and heat::rabbit_virtual_host are deprecated. Please use heat::default_transport_url instead.\x1b[0m\n\x1b[1;33mWarning: ModuleLoader: module \'mysql\' has unresolved dependencies - it will only see those  |
  159. |               | that are resolved. Use \'puppet module list --tree\' to see information about modules\n   (file & line not available)\x1b[0m\n\x1b[1;33mWarning: Unknown variable: \'::nova::db::mysql_api::setup_cell0\'. at                                                               |
  160. |               | /etc/puppet/modules/nova/manifests/db/mysql.pp:53:28\x1b[0m\n\x1b[1;33mWarning: Scope(Class[Nova::Db::Mysql_api]): nova::db::mysql_api::setup_cell0 is deprecated, use nova::db::mysql::setup_cell0 instead. This will be removed in Pike\x1b[0m\n\x1b[1;33mWarning:        |
  161. |               | Scope(Class[Neutron]): neutron::rabbit_host, neutron::rabbit_hosts, neutron::rabbit_password, neutron::rabbit_port, neutron::rabbit_user and neutron::rabbit_virtual_host are deprecated. Please use neutron::default_transport_url instead.\x1b[0m\n\x1b[1;33mWarning:     |
  162. |               | Unknown variable: \'::neutron::params::metadata_agent_package\'. at /etc/puppet/modules/neutron/manifests/agents/metadata.pp:117:6\x1b[0m\n\x1b[1;33mWarning: Unknown variable: \'::vswitch::params::ovsdb_service_name\'. at                                               |
  163. |               | /etc/puppet/modules/vswitch/manifests/ovs.pp:78:6\x1b[0m\n\x1b[1;33mWarning: ModuleLoader: module \'rabbitmq\' has unresolved dependencies - it will only see those that are resolved. Use \'puppet module list --tree\' to see information about modules\n   (file & line  |
  164. |               | not available)\x1b[0m\n\x1b[1;33mWarning: This method is deprecated, please use the stdlib validate_legacy function, with Stdlib::Compat::Absolute_Path. There is further documentation for validate_legacy function in the README. at ["/var/lib/heat-config/heat-config-  |
  165. |               | puppet/fd68cb6c-4390-47a4-9b48-65074d7c3890.pp", 76]:["/etc/puppet/modules/tripleo/manifests/profile/pacemaker/rabbitmq.pp", 62]\n   (at /etc/puppet/modules/stdlib/lib/puppet/functions/deprecation.rb:25:in `deprecation\')\x1b[0m\n\x1b[1;33mWarning: This method is     |
  166. |               | deprecated, please use the stdlib validate_legacy function, with Stdlib::Compat::Integer. There is further documentation for validate_legacy function in the README. at ["/var/lib/heat-config/heat-config-puppet/fd68cb6c-4390-47a4-9b48-65074d7c3890.pp",                 |
  167. |               | 76]:["/etc/puppet/modules/tripleo/manifests/profile/pacemaker/rabbitmq.pp", 62]\n   (at /etc/puppet/modules/stdlib/lib/puppet/functions/deprecation.rb:25:in `deprecation\')\x1b[0m\n\x1b[1;33mWarning: Unknown variable: \'haproxy_stats_bind_certificate\'. at            |
  168. |               | /etc/puppet/modules/tripleo/manifests/haproxy.pp:769:6\x1b[0m\n\x1b[1;33mWarning: ModuleLoader: module \'redis\' has unresolved dependencies - it will only see those that are resolved. Use \'puppet module list --tree\' to see information about modules\n   (file &     |
  169. |               | line not available)\x1b[0m\n\x1b[1;33mWarning: Scope(Class[Nova]): nova::rabbit_host, nova::rabbit_hosts, nova::rabbit_password, nova::rabbit_port, nova::rabbit_userid and nova::rabbit_virtual_host are deprecated. Please use nova::default_transport_url                |
  170. |               | instead.\x1b[0m\n\x1b[1;33mWarning: Unknown variable: \'::nova::scheduler::filter::cpu_allocation_ratio\'. at /etc/puppet/modules/nova/manifests/init.pp:644:37\x1b[0m\n\x1b[1;33mWarning: Unknown variable: \'::nova::scheduler::filter::ram_allocation_ratio\'. at        |
  171. |               | /etc/puppet/modules/nova/manifests/init.pp:646:37\x1b[0m\n\x1b[1;33mWarning: Unknown variable: \'::nova::scheduler::filter::disk_allocation_ratio\'. at /etc/puppet/modules/nova/manifests/init.pp:648:38\x1b[0m\n\x1b[1;33mWarning: ModuleLoader: module \'mongodb\' has   |
  172. |               | unresolved dependencies - it will only see those that are resolved. Use \'puppet module list --tree\' to see information about modules\n   (file & line not available)\x1b[0m\n\x1b[1;33mWarning: Scope(Class[Mongodb::Server]): Replset specified, but no replset_members  |
  173. |               | or replset_config provided.\x1b[0m\n\x1b[1;33mWarning: Unknown variable: \'until_complete_real\'. at /etc/puppet/modules/nova/manifests/cron/archive_deleted_rows.pp:75:82\x1b[0m\n\x1b[1;33mWarning: Unknown variable: \'::nova::compute::vncproxy_host\'. at              |
  174. |               | /etc/puppet/modules/nova/manifests/vncproxy/common.pp:30:5\x1b[0m\n\x1b[1;33mWarning: Unknown variable: \'::nova::compute::vncproxy_protocol\'. at /etc/puppet/modules/nova/manifests/vncproxy/common.pp:35:5\x1b[0m\n\x1b[1;33mWarning: Unknown variable:                  |
  175. |               | \'::nova::compute::vncproxy_port\'. at /etc/puppet/modules/nova/manifests/vncproxy/common.pp:40:5\x1b[0m\n\x1b[1;33mWarning: Unknown variable: \'::nova::compute::vncproxy_path\'. at /etc/puppet/modules/nova/manifests/vncproxy/common.pp:45:5\x1b[0m\n\x1b[1;33mWarning: |
  176. |               | This method is deprecated, please use the stdlib validate_legacy function, with Stdlib::Compat::Numeric. There is further documentation for validate_legacy function in the README. at ["/var/lib/heat-config/heat-config-puppet/fd68cb6c-4390-47a4-9b48-65074d7c3890.pp",  |
  177. |               | 101]:["/etc/puppet/modules/tripleo/manifests/profile/base/time/ntp.pp", 29]\n   (at /etc/puppet/modules/stdlib/lib/puppet/functions/deprecation.rb:25:in `deprecation\')\x1b[0m\n\x1b[1;33mWarning: Unknown variable: \'methods_real\'. at                                  |
  178. |               | /etc/puppet/modules/swift/manifests/proxy/tempurl.pp:100:56\x1b[0m\n\x1b[1;33mWarning: Unknown variable: \'incoming_remove_headers_real\'. at /etc/puppet/modules/swift/manifests/proxy/tempurl.pp:101:56\x1b[0m\n\x1b[1;33mWarning: Unknown variable:                      |
  179. |               | \'incoming_allow_headers_real\'. at /etc/puppet/modules/swift/manifests/proxy/tempurl.pp:102:56\x1b[0m\n\x1b[1;33mWarning: Unknown variable: \'outgoing_remove_headers_real\'. at /etc/puppet/modules/swift/manifests/proxy/tempurl.pp:103:56\x1b[0m\n\x1b[1;33mWarning:    |
  180. |               | Unknown variable: \'outgoing_allow_headers_real\'. at /etc/puppet/modules/swift/manifests/proxy/tempurl.pp:104:56\x1b[0m\n\x1b[1;33mWarning: Unknown variable: \'::snmp_agentaddress\'. at /etc/puppet/modules/snmp/manifests/params.pp:19:19\x1b[0m\n\x1b[1;33mWarning:    |
  181. |               | Unknown variable: \'::snmp_snmptrapdaddr\'. at /etc/puppet/modules/snmp/manifests/params.pp:24:20\x1b[0m\n\x1b[1;33mWarning: Unknown variable: \'::snmp_ro_community\'. at /etc/puppet/modules/snmp/manifests/params.pp:29:19\x1b[0m\n\x1b[1;33mWarning: Unknown variable:  |
  182. |               | \'::snmp_ro_community6\'. at /etc/puppet/modules/snmp/manifests/params.pp:34:20\x1b[0m\n\x1b[1;33mWarning: Unknown variable: \'::snmp_rw_community\'. at /etc/puppet/modules/snmp/manifests/params.pp:39:19\x1b[0m\n\x1b[1;33mWarning: Unknown variable:                    |
  183. |               | \'::snmp_rw_community6\'. at /etc/puppet/modules/snmp/manifests/params.pp:44:20\x1b[0m\n\x1b[1;33mWarning: Unknown variable: \'::snmp_ro_network\'. at /etc/puppet/modules/snmp/manifests/params.pp:49:17\x1b[0m\n\x1b[1;33mWarning: Unknown variable:                      |
  184. |               | \'::snmp_ro_network6\'. at /etc/puppet/modules/snmp/manifests/params.pp:54:18\x1b[0m\n\x1b[1;33mWarning: Unknown variable: \'::snmp_rw_network\'. at /etc/puppet/modules/snmp/manifests/params.pp:59:17\x1b[0m\n\x1b[1;33mWarning: Unknown variable:                        |
  185. |               | \'::snmp_rw_network6\'. at /etc/puppet/modules/snmp/manifests/params.pp:64:18\x1b[0m\n\x1b[1;33mWarning: Unknown variable: \'::snmp_contact\'. at /etc/puppet/modules/snmp/manifests/params.pp:69:14\x1b[0m\n\x1b[1;33mWarning: Unknown variable: \'::snmp_location\'. at   |
  186. |               | /etc/puppet/modules/snmp/manifests/params.pp:74:15\x1b[0m\n\x1b[1;33mWarning: Unknown variable: \'::snmp_sysname\'. at /etc/puppet/modules/snmp/manifests/params.pp:79:14\x1b[0m\n\x1b[1;33mWarning: Unknown variable: \'::snmp_com2sec\'. at                               |
  187. |               | /etc/puppet/modules/snmp/manifests/params.pp:84:14\x1b[0m\n\x1b[1;33mWarning: Unknown variable: \'::snmp_com2sec6\'. at /etc/puppet/modules/snmp/manifests/params.pp:91:15\x1b[0m\n\x1b[1;33mWarning: Unknown variable: \'::snmp_groups\'. at                               |
  188. |               | /etc/puppet/modules/snmp/manifests/params.pp:98:13\x1b[0m\n\x1b[1;33mWarning: Unknown variable: \'::snmp_services\'. at /etc/puppet/modules/snmp/manifests/params.pp:106:15\x1b[0m\n\x1b[1;33mWarning: Unknown variable: \'::openmanage_enable\'. at                        |
  189. |               | /etc/puppet/modules/snmp/manifests/params.pp:111:24\x1b[0m\n\x1b[1;33mWarning: Unknown variable: \'::snmp_views\'. at /etc/puppet/modules/snmp/manifests/params.pp:116:12\x1b[0m\n\x1b[1;33mWarning: Unknown variable: \'::snmp_accesses\'. at                              |
  190. |               | /etc/puppet/modules/snmp/manifests/params.pp:124:15\x1b[0m\n\x1b[1;33mWarning: Unknown variable: \'::snmp_dlmod\'. at /etc/puppet/modules/snmp/manifests/params.pp:131:12\x1b[0m\n\x1b[1;33mWarning: Unknown variable: \'::snmp_disable_authorization\'. at                 |
  191. |               | /etc/puppet/modules/snmp/manifests/params.pp:136:28\x1b[0m\n\x1b[1;33mWarning: Unknown variable: \'::snmp_do_not_log_traps\'. at /etc/puppet/modules/snmp/manifests/params.pp:141:23\x1b[0m\n\x1b[1;33mWarning: Unknown variable: \'::snmp_do_not_log_tcpwrappers\'. at     |
  192. |               | /etc/puppet/modules/snmp/manifests/params.pp:146:29\x1b[0m\n\x1b[1;33mWarning: Unknown variable: \'::snmp_trap_handlers\'. at /etc/puppet/modules/snmp/manifests/params.pp:151:20\x1b[0m\n\x1b[1;33mWarning: Unknown variable: \'::snmp_trap_forwards\'. at                 |
  193. |               | /etc/puppet/modules/snmp/manifests/params.pp:156:20\x1b[0m\n\x1b[1;33mWarning: Unknown variable: \'::snmp_snmp_config\'. at /etc/puppet/modules/snmp/manifests/params.pp:161:18\x1b[0m\n\x1b[1;33mWarning: Unknown variable: \'::snmp_snmpd_config\'. at                    |
  194. |               | /etc/puppet/modules/snmp/manifests/params.pp:166:19\x1b[0m\n\x1b[1;33mWarning: Unknown variable: \'::snmp_snmptrapd_config\'. at /etc/puppet/modules/snmp/manifests/params.pp:171:23\x1b[0m\n\x1b[1;33mWarning: Unknown variable: \'::snmp_ensure\'. at                     |
  195. |               | /etc/puppet/modules/snmp/manifests/params.pp:178:13\x1b[0m\n\x1b[1;33mWarning: Unknown variable: \'::snmp_service_ensure\'. at /etc/puppet/modules/snmp/manifests/params.pp:183:21\x1b[0m\n\x1b[1;33mWarning: Unknown variable: \'::snmp_trap_service_ensure\'. at          |
  196. |               | /etc/puppet/modules/snmp/manifests/params.pp:188:26\x1b[0m\n\x1b[1;33mWarning: Unknown variable: \'::snmp_autoupgrade\'. at /etc/puppet/modules/snmp/manifests/params.pp:195:18\x1b[0m\n\x1b[1;33mWarning: Unknown variable: \'::snmp_install_client\'. at                  |
  197. |               | /etc/puppet/modules/snmp/manifests/params.pp:205:21\x1b[0m\n\x1b[1;33mWarning: Unknown variable: \'::snmp_manage_client\'. at /etc/puppet/modules/snmp/manifests/params.pp:210:20\x1b[0m\n\x1b[1;33mWarning: Unknown variable: \'::snmp_service_enable\'. at                |
  198. |               | /etc/puppet/modules/snmp/manifests/params.pp:220:21\x1b[0m\n\x1b[1;33mWarning: Unknown variable: \'::snmp_service_hasstatus\'. at /etc/puppet/modules/snmp/manifests/params.pp:230:24\x1b[0m\n\x1b[1;33mWarning: Unknown variable: \'::snmp_service_hasrestart\'. at        |
  199. |               | /etc/puppet/modules/snmp/manifests/params.pp:240:25\x1b[0m\n\x1b[1;33mWarning: Unknown variable: \'::snmp_trap_service_enable\'. at /etc/puppet/modules/snmp/manifests/params.pp:250:26\x1b[0m\n\x1b[1;33mWarning: Unknown variable: \'::snmp_trap_service_hasstatus\'. at  |
  200. |               | /etc/puppet/modules/snmp/manifests/params.pp:260:29\x1b[0m\n\x1b[1;33mWarning: Unknown variable: \'::snmp_trap_service_hasrestart\'. at /etc/puppet/modules/snmp/manifests/params.pp:270:30\x1b[0m\n\x1b[1;33mWarning: ModuleLoader: module \'timezone\' has unresolved     |
  201. |               | dependencies - it will only see those that are resolved. Use \'puppet module list --tree\' to see information about modules\n   (file & line not available)\x1b[0m\n\x1b[1;33mWarning: Scope(Class[Ceilometer]): ceilometer::rabbit_host, ceilometer::rabbit_hosts,         |
  202. |               | ceilometer::rabbit_password, ceilometer::rabbit_port, ceilometer::rabbit_userid and ceilometer::rabbit_virtual_host are deprecated. Please use ceilometer::default_transport_url instead.\x1b[0m\n\x1b[1;33mWarning: Scope(Class[Ceilometer::Api]): ceilometer-api has been |
  203. |               | deprecated in Ocata and will be removed in future. Please use Aodh, Gnocchi and Panko modules instead.\x1b[0m\n\x1b[1;33mWarning: This method is deprecated, please use match expressions with Stdlib::Compat::Ip_address instead. They are described at                    |
  204. |               | https://docs.puppet.com/puppet/latest/reference/lang_data_type.html#match-expressions. at ["/var/lib/heat-config/heat-config-puppet/fd68cb6c-4390-47a4-9b48-65074d7c3890.pp", 113]:["/etc/puppet/modules/tripleo/manifests/profile/base/ceilometer/collector.pp", 84]\n     |
  205. |               | (at /etc/puppet/modules/stdlib/lib/puppet/functions/deprecation.rb:25:in `deprecation\')\x1b[0m\n\x1b[1;33mWarning: Scope(Class[Ceilometer::Agent::Central]): This class is deprecated. Please use ceilometer::agent::central with central namespace                        |
  206. |               | instead.\x1b[0m\n\x1b[1;33mWarning: ModuleLoader: module \'horizon\' has unresolved dependencies - it will only see those that are resolved. Use \'puppet module list --tree\' to see information about modules\n   (file & line not available)\x1b[0m\n\x1b[1;33mWarning:  |
  207. |               | Undefined variable \'\'; \n   (file & line not available)\x1b[0m\n\x1b[1;33mWarning: Scope(Class[Aodh]): aodh::rabbit_host, aodh::rabbit_hosts, aodh::rabbit_password, aodh::rabbit_port, aodh::rabbit_userid and aodh::rabbit_virtual_host are deprecated. Please use      |
  208. |               | aodh::default_transport_url instead.\x1b[0m\n\x1b[1;33mWarning: You cannot collect exported resources without storeconfigs being set; the collection will be ignored at /etc/puppet/modules/panko/manifests/api.pp:110:5\x1b[0m\n\x1b[1;33mWarning:                         |
  209. |               | Scope(Oslo::Messaging::Rabbit[cinder_config]): The oslo_messaging rabbit_host, rabbit_hosts, rabbit_port, rabbit_userid, rabbit_password, rabbit_virtual_host parameters have been deprecated by the [DEFAULT]\\transport_url. Please use                                   |
  210. |               | oslo::messaging::default::transport_url instead.\x1b[0m\n\x1b[1;33mWarning: Scope(Oslo::Messaging::Rabbit[keystone_config]): The oslo_messaging rabbit_host, rabbit_hosts, rabbit_port, rabbit_userid, rabbit_password, rabbit_virtual_host parameters have been deprecated |
  211. |               | by the [DEFAULT]\\transport_url. Please use oslo::messaging::default::transport_url instead.\x1b[0m\n\x1b[1;33mWarning: Scope(Oslo::Messaging::Rabbit[glance_api_config]): The oslo_messaging rabbit_host, rabbit_hosts, rabbit_port, rabbit_userid, rabbit_password,       |
  212. |               | rabbit_virtual_host parameters have been deprecated by the [DEFAULT]\\transport_url. Please use oslo::messaging::default::transport_url instead.\x1b[0m\n\x1b[1;33mWarning: Scope(Oslo::Messaging::Rabbit[glance_registry_config]): The oslo_messaging rabbit_host,         |
  213. |               | rabbit_hosts, rabbit_port, rabbit_userid, rabbit_password, rabbit_virtual_host parameters have been deprecated by the [DEFAULT]\\transport_url. Please use oslo::messaging::default::transport_url instead.\x1b[0m\n\x1b[1;33mWarning:                                      |
  214. |               | Scope(Oslo::Messaging::Rabbit[neutron_config]): The oslo_messaging rabbit_host, rabbit_hosts, rabbit_port, rabbit_userid, rabbit_password, rabbit_virtual_host parameters have been deprecated by the [DEFAULT]\\transport_url. Please use                                  |
  215. |               | oslo::messaging::default::transport_url instead.\x1b[0m\n\x1b[1;33mWarning: This method is deprecated, please use match expressions with Stdlib::Compat::Ipv6 instead. They are described at https://docs.puppet.com/puppet/latest/reference/lang_data_type.html#match-     |
  216. |               | expressions. at :\n   (at /etc/puppet/modules/stdlib/lib/puppet/functions/deprecation.rb:25:in `deprecation\')\x1b[0m\n\x1b[1;33mWarning: Scope(Oslo::Messaging::Rabbit[ceilometer_config]): The oslo_messaging rabbit_host, rabbit_hosts, rabbit_port, rabbit_userid,      |
  217. |               | rabbit_password, rabbit_virtual_host parameters have been deprecated by the [DEFAULT]\\transport_url. Please use oslo::messaging::default::transport_url instead.\x1b[0m\n\x1b[1;33mWarning: Scope(Oslo::Messaging::Rabbit[aodh_config]): The oslo_messaging rabbit_host,   |
  218. |               | rabbit_hosts, rabbit_port, rabbit_userid, rabbit_password, rabbit_virtual_host parameters have been deprecated by the [DEFAULT]\\transport_url. Please use oslo::messaging::default::transport_url instead.\x1b[0m\n\x1b[1;33mWarning: Scope(Haproxy::Config[haproxy]):     |
  219. |               | haproxy: The $merge_options parameter will default to true in the next major release. Please review the documentation regarding the implications.\x1b[0m\n\x1b[1;33mWarning: [norpm] Attempting to uninstall openstack-nova-migration but it will not be                    |
  220. |               | removed\x1b[0m\n\x1b[1;31mError: ceilometer-upgrade --skip-metering-database returned 1 instead of one of [0]\x1b[0m\n\x1b[1;31mError: /Stage[main]/Tripleo::Profile::Base::Ceilometer::Collector/Exec[ceilometer-db-upgrade]/returns: change from notrun to 0 failed:      |
  221. |               | ceilometer-upgrade --skip-metering-database returned 1 instead of one of [0]\x1b[0m\n', u'deploy_status_code': 6}

Reply to "overcloud"

Here you can reply to the paste above