error

From remo, 3 Years ago, written in Plain Text, viewed 299 times.
URL http://pastebin.mattei.co/index.php/view/aa2f3518 Embed
Download Paste or View Raw
  1. :msg:main --->  Computing dependencies for cmake:info:main .:debug:main Checking for conflicts against cmake
  2. :debug:main Searching for dependency: cmake-devel
  3. :debug:main Didn't find receipt, going to depspec regex for: cmake-devel
  4. :debug:main Searching for dependency: curl
  5. :debug:main Found Dependency: receipt exists for curl
  6. :debug:main Searching for dependency: expat
  7. :debug:main Found Dependency: receipt exists for expat
  8. :debug:main Searching for dependency: zlib
  9. :debug:main Found Dependency: receipt exists for zlib
  10. :debug:main Searching for dependency: bzip2
  11. :debug:main Found Dependency: receipt exists for bzip2
  12. :debug:main Searching for dependency: libarchive
  13. :debug:main Found Dependency: receipt exists for libarchive
  14. :msg:main
  15. :debug:main Executing org.macports.main (cmake)
  16. :debug:main changing euid/egid - current euid: 0 - current egid: 0
  17. :debug:main egid changed to: 501
  18. :debug:main euid changed to: 502
  19. :debug:main Skipping completed org.macports.archivefetch (cmake)
  20. :debug:main Privilege de-escalation not attempted as not running as root.
  21. :debug:main Skipping completed org.macports.fetch (cmake)
  22. :debug:main Privilege de-escalation not attempted as not running as root.
  23. :debug:main Skipping completed org.macports.checksum (cmake)
  24. :debug:main Privilege de-escalation not attempted as not running as root.
  25. :debug:main Skipping completed org.macports.extract (cmake)
  26. :debug:main Privilege de-escalation not attempted as not running as root.
  27. :debug:main Skipping completed org.macports.patch (cmake)
  28. :debug:main Privilege de-escalation not attempted as not running as root.
  29. :debug:main Skipping completed org.macports.configure (cmake)
  30. :debug:main Privilege de-escalation not attempted as not running as root.
  31. :debug:build build phase started at Thu Oct  1 21:55:04 CEST 2015
  32. :notice:build --->  Building cmake
  33. :debug:build Executing org.macports.build (cmake)
  34. :debug:build Environment:
  35. CC_PRINT_OPTIONS='YES'
  36. CC_PRINT_OPTIONS_FILE='/opt/local/var/macports/build/_opt_local_var_macports_sources_rsync.macports.org_release_tarballs_ports_devel_cmake/cmake/work/.CC_PRINT_OPTIONS'
  37. CPATH='/opt/local/include'
  38. LIBRARY_PATH='/opt/local/lib'
  39. MACOSX_DEPLOYMENT_TARGET='10.11'
  40. :debug:build Assembled command: 'cd "/opt/local/var/macports/build/_opt_local_var_macports_sources_rsync.macports.org_release_tarballs_ports_devel_cmake/cmake/work/cmake-3.3.2" && /usr/bin/make -j4 -w all VERBOSE=ON'
  41. :debug:build Executing command line:  cd "/opt/local/var/macports/build/_opt_local_var_macports_sources_rsync.macports.org_release_tarballs_ports_devel_cmake/cmake/work/cmake-3.3.2" && /usr/bin/make -j4 -w all VERBOSE=ON
  42. :info:build make: Entering directory `/opt/local/var/macports/build/_opt_local_var_macports_sources_rsync.macports.org_release_tarballs_ports_devel_cmake/cmake/work/cmake-3.3.2'
  43. :info:build /opt/local/var/macports/build/_opt_local_var_macports_sources_rsync.macports.org_release_tarballs_ports_devel_cmake/cmake/work/cmake-3.3.2/Bootstrap.cmk/cmake -H/opt/local/var/macports/build/_opt_local_var_macports_sources_rsync.macports.org_release_tarballs_ports_devel_cmake/cmake/work/cmake-3.3.2 -B/opt/local/var/macports/build/_opt_local_var_macports_sources_rsync.macports.org_release_tarballs_ports_devel_cmake/cmake/work/cmake-3.3.2 --check-build-system CMakeFiles/Makefile.cmake 0
  44. :info:build /opt/local/var/macports/build/_opt_local_var_macports_sources_rsync.macports.org_release_tarballs_ports_devel_cmake/cmake/work/cmake-3.3.2/Bootstrap.cmk/cmake -E cmake_progress_start /opt/local/var/macports/build/_opt_local_var_macports_sources_rsync.macports.org_release_tarballs_ports_devel_cmake/cmake/work/cmake-3.3.2/CMakeFiles /opt/local/var/macports/build/_opt_local_var_macports_sources_rsync.macports.org_release_tarballs_ports_devel_cmake/cmake/work/cmake-3.3.2/CMakeFiles/progress.marks
  45. :info:build /Applications/Xcode.app/Contents/Developer/usr/bin/make -f CMakeFiles/Makefile2 all
  46. :info:build make[1]: Entering directory `/opt/local/var/macports/build/_opt_local_var_macports_sources_rsync.macports.org_release_tarballs_ports_devel_cmake/cmake/work/cmake-3.3.2'
  47. :info:build /Applications/Xcode.app/Contents/Developer/usr/bin/make -f Utilities/KWIML/test/CMakeFiles/cmIML_test.dir/build.make Utilities/KWIML/test/CMakeFiles/cmIML_test.dir/depend
  48. :info:build /Applications/Xcode.app/Contents/Developer/usr/bin/make -f Source/kwsys/CMakeFiles/cmsys.dir/build.make Source/kwsys/CMakeFiles/cmsys.dir/depend
  49. :info:build /Applications/Xcode.app/Contents/Developer/usr/bin/make -f Source/kwsys/CMakeFiles/cmsys_c.dir/build.make Source/kwsys/CMakeFiles/cmsys_c.dir/depend
  50. :info:build /Applications/Xcode.app/Contents/Developer/usr/bin/make -f Utilities/cmcompress/CMakeFiles/cmcompress.dir/build.make Utilities/cmcompress/CMakeFiles/cmcompress.dir/depend
  51. :info:build make[2]: Entering directory `/opt/local/var/macports/build/_opt_local_var_macports_sources_rsync.macports.org_release_tarballs_ports_devel_cmake/cmake/work/cmake-3.3.2'
  52. :info:build cd /opt/local/var/macports/build/_opt_local_var_macports_sources_rsync.macports.org_release_tarballs_ports_devel_cmake/cmake/work/cmake-3.3.2 && /opt/local/var/macports/build/_opt_local_var_macports_sources_rsync.macports.org_release_tarballs_ports_devel_cmake/cmake/work/cmake-3.3.2/Bootstrap.cmk/cmake -E cmake_depends "Unix Makefiles" /opt/local/var/macports/build/_opt_local_var_macports_sources_rsync.macports.org_release_tarballs_ports_devel_cmake/cmake/work/cmake-3.3.2 /opt/local/var/macports/build/_opt_local_var_macports_sources_rsync.macports.org_release_tarballs_ports_devel_cmake/cmake/work/cmake-3.3.2/Utilities/KWIML/test /opt/local/var/macports/build/_opt_local_var_macports_sources_rsync.macports.org_release_tarballs_ports_devel_cmake/cmake/work/cmake-3.3.2 /opt/local/var/macports/build/_opt_local_var_macports_sources_rsync.macports.org_release_tarballs_ports_devel_cmake/cmake/work/cmake-3.3.2/Utilities/KWIML/test /opt/local/var/macports/build/_opt_local_var_macports_sources_rsync.macports.org_release_tarballs_ports_devel_cmake/cmake/work/cmake-3.3.2/Utilities/KWIML/test/CMakeFiles/cmIML_test.dir/DependInfo.cmake --color=
  53. :info:build make[2]: Entering directory `/opt/local/var/macports/build/_opt_local_var_macports_sources_rsync.macports.org_release_tarballs_ports_devel_cmake/cmake/work/cmake-3.3.2'
  54. :info:build cd /opt/local/var/macports/build/_opt_local_var_macports_sources_rsync.macports.org_release_tarballs_ports_devel_cmake/cmake/work/cmake-3.3.2 && /opt/local/var/macports/build/_opt_local_var_macports_sources_rsync.macports.org_release_tarballs_ports_devel_cmake/cmake/work/cmake-3.3.2/Bootstrap.cmk/cmake -E cmake_depends "Unix Makefiles" /opt/local/var/macports/build/_opt_local_var_macports_sources_rsync.macports.org_release_tarballs_ports_devel_cmake/cmake/work/cmake-3.3.2 /opt/local/var/macports/build/_opt_local_var_macports_sources_rsync.macports.org_release_tarballs_ports_devel_cmake/cmake/work/cmake-3.3.2/Utilities/cmcompress /opt/local/var/macports/build/_opt_local_var_macports_sources_rsync.macports.org_release_tarballs_ports_devel_cmake/cmake/work/cmake-3.3.2 /opt/local/var/macports/build/_opt_local_var_macports_sources_rsync.macports.org_release_tarballs_ports_devel_cmake/cmake/work/cmake-3.3.2/Utilities/cmcompress /opt/local/var/macports/build/_opt_local_var_macports_sources_rsync.macports.org_release_tarballs_ports_devel_cmake/cmake/work/cmake-3.3.2/Utilities/cmcompress/CMakeFiles/cmcompress.dir/DependInfo.cmake --color=
  55. :info:build make[2]: Entering directory `/opt/local/var/macports/build/_opt_local_var_macports_sources_rsync.macports.org_release_tarballs_ports_devel_cmake/cmake/work/cmake-3.3.2'
  56. :info:build cd /opt/local/var/macports/build/_opt_local_var_macports_sources_rsync.macports.org_release_tarballs_ports_devel_cmake/cmake/work/cmake-3.3.2 && /opt/local/var/macports/build/_opt_local_var_macports_sources_rsync.macports.org_release_tarballs_ports_devel_cmake/cmake/work/cmake-3.3.2/Bootstrap.cmk/cmake -E cmake_depends "Unix Makefiles" /opt/local/var/macports/build/_opt_local_var_macports_sources_rsync.macports.org_release_tarballs_ports_devel_cmake/cmake/work/cmake-3.3.2 /opt/local/var/macports/build/_opt_local_var_macports_sources_rsync.macports.org_release_tarballs_ports_devel_cmake/cmake/work/cmake-3.3.2/Source/kwsys /opt/local/var/macports/build/_opt_local_var_macports_sources_rsync.macports.org_release_tarballs_ports_devel_cmake/cmake/work/cmake-3.3.2 /opt/local/var/macports/build/_opt_local_var_macports_sources_rsync.macports.org_release_tarballs_ports_devel_cmake/cmake/work/cmake-3.3.2/Source/kwsys /opt/local/var/macports/build/_opt_local_var_macports_sources_rsync.macports.org_release_tarballs_ports_devel_cmake/cmake/work/cmake-3.3.2/Source/kwsys/CMakeFiles/cmsys_c.dir/DependInfo.cmake --color=
  57. :info:build make[2]: Entering directory `/opt/local/var/macports/build/_opt_local_var_macports_sources_rsync.macports.org_release_tarballs_ports_devel_cmake/cmake/work/cmake-3.3.2'
  58. :info:build cd /opt/local/var/macports/build/_opt_local_var_macports_sources_rsync.macports.org_release_tarballs_ports_devel_cmake/cmake/work/cmake-3.3.2 && /opt/local/var/macports/build/_opt_local_var_macports_sources_rsync.macports.org_release_tarballs_ports_devel_cmake/cmake/work/cmake-3.3.2/Bootstrap.cmk/cmake -E cmake_depends "Unix Makefiles" /opt/local/var/macports/build/_opt_local_var_macports_sources_rsync.macports.org_release_tarballs_ports_devel_cmake/cmake/work/cmake-3.3.2 /opt/local/var/macports/build/_opt_local_var_macports_sources_rsync.macports.org_release_tarballs_ports_devel_cmake/cmake/work/cmake-3.3.2/Source/kwsys /opt/local/var/macports/build/_opt_local_var_macports_sources_rsync.macports.org_release_tarballs_ports_devel_cmake/cmake/work/cmake-3.3.2 /opt/local/var/macports/build/_opt_local_var_macports_sources_rsync.macports.org_release_tarballs_ports_devel_cmake/cmake/work/cmake-3.3.2/Source/kwsys /opt/local/var/macports/build/_opt_local_var_macports_sources_rsync.macports.org_release_tarballs_ports_devel_cmake/cmake/work/cmake-3.3.2/Source/kwsys/CMakeFiles/cmsys.dir/DependInfo.cmake --color=
  59. :info:build make[2]: Leaving directory `/opt/local/var/macports/build/_opt_local_var_macports_sources_rsync.macports.org_release_tarballs_ports_devel_cmake/cmake/work/cmake-3.3.2'
  60. :info:build /Applications/Xcode.app/Contents/Developer/usr/bin/make -f Utilities/cmcompress/CMakeFiles/cmcompress.dir/build.make Utilities/cmcompress/CMakeFiles/cmcompress.dir/build
  61. :info:build make[2]: Leaving directory `/opt/local/var/macports/build/_opt_local_var_macports_sources_rsync.macports.org_release_tarballs_ports_devel_cmake/cmake/work/cmake-3.3.2'
  62. :info:build /Applications/Xcode.app/Contents/Developer/usr/bin/make -f Utilities/KWIML/test/CMakeFiles/cmIML_test.dir/build.make Utilities/KWIML/test/CMakeFiles/cmIML_test.dir/build
  63. :info:build make[2]: Entering directory `/opt/local/var/macports/build/_opt_local_var_macports_sources_rsync.macports.org_release_tarballs_ports_devel_cmake/cmake/work/cmake-3.3.2'
  64. :info:build make[2]: Nothing to be done for `Utilities/cmcompress/CMakeFiles/cmcompress.dir/build'.
  65. :info:build make[2]: Leaving directory `/opt/local/var/macports/build/_opt_local_var_macports_sources_rsync.macports.org_release_tarballs_ports_devel_cmake/cmake/work/cmake-3.3.2'
  66. :
  67. akeFiles/cmcompress.dir/DependInfo.cmake --color=
  68. :info:build make[2]: Entering directory `/opt/local/var/macports/build/_opt_local_var_macports_sources_rsync.macports.org_release_tarballs_ports_devel_cmake/cmake/work/cmake-3.3.2'
  69. :info:build cd /opt/local/var/macports/build/_opt_local_var_macports_sources_rsync.macports.org_release_tarballs_ports_devel_cmake/cmake/work/cmake-3.3.2 && /opt/local/var/macports/build/_opt_local_var_macports_sources_rsync.macports.org_release_tarballs_ports_devel_cmake/cmake/work/cmake-3.3.2/Bootstrap.cmk/cmake -E cmake_depends "Unix Makefiles" /opt/local/var/macports/build/_opt_local_var_macports_sources_rsync.macports.org_release_tarballs_ports_devel_cmake/cmake/work/cmake-3.3.2 /opt/local/var/macports/build/_opt_local_var_macports_sources_rsync.macports.org_release_tarballs_ports_devel_cmake/cmake/work/cmake-3.3.2/Source/kwsys /opt/local/var/macports/build/_opt_local_var_macports_sources_rsync.macports.org_release_tarballs_ports_devel_cmake/cmake/work/cmake-3.3.2 /opt/local/var/macports/build/_opt_local_var_macports_sources_rsync.macports.org_release_tarballs_ports_devel_cmake/cmake/work/cmake-3.3.2/Source/kwsys /opt/local/var/macports/build/_opt_local_var_macports_sources_rsync.macports.org_release_tarballs_ports_devel_cmake/cmake/work/cmake-3.3.2/Source/kwsys/CMakeFiles/cmsys_c.dir/DependInfo.cmake --color=
  70. :info:build make[2]: Entering directory `/opt/local/var/macports/build/_opt_local_var_macports_sources_rsync.macports.org_release_tarballs_ports_devel_cmake/cmake/work/cmake-3.3.2'
  71. :info:build cd /opt/local/var/macports/build/_opt_local_var_macports_sources_rsync.macports.org_release_tarballs_ports_devel_cmake/cmake/work/cmake-3.3.2 && /opt/local/var/macports/build/_opt_local_var_macports_sources_rsync.macports.org_release_tarballs_ports_devel_cmake/cmake/work/cmake-3.3.2/Bootstrap.cmk/cmake -E cmake_depends "Unix Makefiles" /opt/local/var/macports/build/_opt_local_var_macports_sources_rsync.macports.org_release_tarballs_ports_devel_cmake/cmake/work/cmake-3.3.2 /opt/local/var/macports/build/_opt_local_var_macports_sources_rsync.macports.org_release_tarballs_ports_devel_cmake/cmake/work/cmake-3.3.2/Source/kwsys /opt/local/var/macports/build/_opt_local_var_macports_sources_rsync.macports.org_release_tarballs_ports_devel_cmake/cmake/work/cmake-3.3.2 /opt/local/var/macports/build/_opt_local_var_macports_sources_rsync.macports.org_release_tarballs_ports_devel_cmake/cmake/work/cmake-3.3.2/Source/kwsys /opt/local/var/macports/build/_opt_local_var_macports_sources_rsync.macports.org_release_tarballs_ports_devel_cmake/cmake/work/cmake-3.3.2/Source/kwsys/CMakeFiles/cmsys.dir/DependInfo.cmake --color=
  72. :info:build make[2]: Leaving directory `/opt/local/var/macports/build/_opt_local_var_macports_sources_rsync.macports.org_release_tarballs_ports_devel_cmake/cmake/work/cmake-3.3.2'
  73. :info:build /Applications/Xcode.app/Contents/Developer/usr/bin/make -f Utilities/cmcompress/CMakeFiles/cmcompress.dir/build.make Utilities/cmcompress/CMakeFiles/cmcompress.dir/build
  74. :info:build make[2]: Leaving directory `/opt/local/var/macports/build/_opt_local_var_macports_sources_rsync.macports.org_release_tarballs_ports_devel_cmake/cmake/work/cmake-3.3.2'
  75. :info:build /Applications/Xcode.app/Contents/Developer/usr/bin/make -f Utilities/KWIML/test/CMakeFiles/cmIML_test.dir/build.make Utilities/KWIML/test/CMakeFiles/cmIML_test.dir/build
  76. :info:build make[2]: Entering directory `/opt/local/var/macports/build/_opt_local_var_macports_sources_rsync.macports.org_release_tarballs_ports_devel_cmake/cmake/work/cmake-3.3.2'
  77. :info:build make[2]: Nothing to be done for `Utilities/cmcompress/CMakeFiles/cmcompress.dir/build'.
  78. :info:build make[2]: Leaving directory `/opt/local/var/macports/build/_opt_local_var_macports_sources_rsync.macports.org_release_tarballs_ports_devel_cmake/cmake/work/cmake-3.3.2'
  79. :info:build make[2]: Leaving directory `/opt/local/var/macports/build/_opt_local_var_macports_sources_rsync.macports.org_release_tarballs_ports_devel_cmake/cmake/work/cmake-3.3.2'
  80. :info:buications/Xcode.app/Contents/Developer/usr/bin/make -f Source/kwsys/CMakeFiles/cmsys_c.dir/build.make Source/kwsys/CMakeFiles/cmsys_c.dir/build
  81. :
  82. akeFiles/cmcompress.dir/DependInfo.cmake --color=
  83. :info:build make[2]: Entering directory `/opt/local/var/macports/build/_opt_local_var_macports_sources_rsync.macports.org_release_tarballs_ports_devel_cmake/cmake/work/cmake-3.3.2'
  84. :info:build cd /opt/local/var/macports/build/_opt_local_var_macports_sources_rsync.macports.org_release_tarballs_ports_devel_cmake/cmake/work/cmake-3.3.2 && /opt/local/var/macports/build/_opt_local_var_macports_sources_rsync.macports.org_release_tarballs_ports_devel_cmake/cmake/work/cmake-3.3.2/Bootstrap.cmk/cmake -E cmake_depends "Unix Makefiles" /opt/local/var/macports/build/_opt_local_var_macports_sources_rsync.macports.org_release_tarballs_ports_devel_cmake/cmake/work/cmake-3.3.2 /opt/local/var/macports/build/_opt_local_var_macports_sources_rsync.macports.org_release_tarballs_ports_devel_cmake/cmake/work/cmake-3.3.2/Source/kwsys /opt/local/var/macports/build/_opt_local_var_macports_sources_rsync.macports.org_release_tarballs_ports_devel_cmake/cmake/work/cmake-3.3.2 /opt/local/var/macports/build/_opt_local_var_macports_sources_rsync.macports.org_release_tarballs_ports_devel_cmake/cmake/work/cmake-3.3.2/Source/kwsys /opt/local/var/macports/build/_opt_local_var_macports_sources_rsync.macports.org_release_tarballs_ports_devel_cmake/cmake/work/cmake-3.3.2/Source/kwsys/CMakeFiles/cmsys_c.dir/DependInfo.cmake --color=
  85. :info:build make[2]: Entering directory `/opt/local/var/macports/build/_opt_local_var_macports_sources_rsync.macports.org_release_tarballs_ports_devel_cmake/cmake/work/cmake-3.3.2'
  86. :info:build cd /opt/local/var/macports/build/_opt_local_var_macports_sources_rsync.macports.org_release_tarballs_ports_devel_cmake/cmake/work/cmake-3.3.2 && /opt/local/var/macports/build/_opt_local_var_macports_sources_rsync.macports.org_release_tarballs_ports_devel_cmake/cmake/work/cmake-3.3.2/Bootstrap.cmk/cmake -E cmake_deds "Unix Makefiles" /opt/local/var/macports/build/_opt_local_var_macports_sources_rsync.macports.org_release_tarballs_ports_devel_cmake/cmake/work/cmake-3.3.2 /opt/local/var/macports/build/_opt_local_var_macports_sources_rsync.macports.org_release_tarballs_ports_devel_cmake/cmake/work/cmake-3.3.2/Source/kwsys /opt/local/var/macports/build/_opt_local_var_macports_sources_rsync.macports.org_release_tarballs_ports_devel_cmake/cmake/work/cmake-3.3.2 /opt/local/var/macports/build/_opt_local_var_macports_sources_rsync.macports.org_release_tarballs_ports_devel_cmake/cmake/work/cmake-3.3.2/Source/kwsys /opt/local/var/macports/build/_opt_local_var_macports_sources_rsync.macports.org_release_tarballs_ports_devel_cmake/cmake/work/cmake-3.3.2/Source/kwsys/CMakeFiles/cmsys.dir/DependInfo.cmake --color=
  87. :info:build make[2]: Leaving directory `/opt/local/var/macports/build/_opt_local_var_macports_sources_rsync.macports.org_release_tarballs_ports_devel_cmake/cmake/work/cmake-3.3.2'
  88. :info:build /Applications/Xcode.app/Contents/Developer/usr/bin/make -f Utilities/cmcompress/CMakeFiles/cmcompress.dir/build.make Utilities/cmcompress/CMakeFiles/cmcompress.dir/build
  89. :info:build make[2]: Leaving directory `/opt/local/var/macports/build/_opt_local_var_macports_sources_rsync.macports.org_release_tarballs_ports_devel_cmake/cmake/work/cmake-3.3.2'
  90. :info:build /Applications/Xcode.app/Contents/Developer/usr/bin/make -f Utilities/KWIML/test/CMakeFiles/cmIML_test.dir/build.make Utilities/KWIML/test/CMakeFiles/cmIML_test.dir/build
  91. :info:build make[2]: Entering directory `/opt/local/var/macports/build/_opt_local_var_macports_sources_rsync.macports.org_release_tarballs_ports_devel_cmake/cmake/work/cmake-3.3.2'
  92. :info:build make[2]: Nothing to be done for `Utilities/cmcompress/CMakeFiles/cmcompress.dir/build'.
  93. :info:build make[2]: Leaving directory `/opt/local/var/macports/build/_opt_local_var_macports_sources_rsync.macports.org_release_tarballs_ports_devel_cmake/cmake/work/cmake-3.3.2'
  94. :info:build make[2]: Leaving directory `/opt/var/macports/build/_opt_local_var_macports_sources_rsync.macports.org_release_tarballs_ports_devel_cmake/cmake/work/cmake-3.3.2'
  95. :info:build /Applications/Xcode.app/Contents/Developer/usr/bin/make -f Source/kwsys/CMakeFiles/cmsys_c.dir/build.make Source/kwsys/CMakeFiles/cmsys_c.dir/build
  96. :info:build make[2]: Entering directory `/opt/local/var/macports/build/_opt_local_var_macports_sources_rsync.macports.org_release_tarballs_ports_devel_cmake/cmake/work/cmake-3.3.2'
  97. :info:build make[2]: Nothing to be done for `Utilities/KWIML/test/CMakeFiles/cmIML_test.dir/build'.
  98. :info:build make[2]: Leaving directory `/opt/local/var/macports/build/_opt_local_var_macports_sources_rsync.macports.org_release_tarballs_ports_devel_cmake/cmake/work/cmake-3.3.2'
  99. :
  100. akeFiles/cmcompress.dir/DependInfo.cmake --color=
  101. :info:build make[2]: Entering directory `/opt/local/var/macports/build/_opt_local_var_macports_sources_rsync.macports.org_release_tarballs_ports_devel_cmake/cmake/work/cmake-3.3.2'
  102. :info:build cd /opt/local/var/macports/build/_opt_local_var_macports_sources_rsync.macports.org_release_tarballs_ports_devel_cmake/cmake/work/cmake-3.3.2 && /opt/local/var/macports/build/_opt_local_var_macports_sources_rsync.macports.org_release_tarballs_ports_devel_cmake/cmake/work/cmake-3.3.2/Bootstrap.cmk/cmake -E cmake_depends "Unix Makefiles" /opt/local/var/macports/build/_opt_local_var_macports_sources_rsync.macports.org_release_tarballs_ports_devel_cmake/cmake/work/cmake-3.3.2 /opt/local/var/macports/build/_opt_local_var_macports_sources_rsync.macports.org_release_tarballs_ports_devel_cmake/cmake/work/cmake-3.3.2/Source/kwsys /opt/local/var/macports/build/_opt_local_var_macports_sources_rsync.macports.org_release_tarballs_ports_devel_cmake/cmake/work/cmake-3.3.2 /opt/local/var/macports/build/_opt_local_var_macports_sources_rsync.macports.org_release_tarballs_ports_devel_cmake/cmake/work/cmake-3.3.2/Source/kwsys /opt/local/var/macports/build/_opt_local_var_macports_sources_rsync.macports.org_release_tarballs_ports_develports_devel_cmake/cmake/work/cmake-3.3.2 /opt/local/var/macports/build/_opt_local_var_macports_sources_rsync.macports.org_release_tarballs_ports_devel_cmake/cmake/work/cmake-3.3.2/Source/kwsys /opt/local/var/macports/build/_opt_local_var_macports_sources_rsync.macports.org_release_tarballs_ports_devel_cmake/cmake/work/cmake-3.3.2/Source/kwsys/CMakeFiles/cmsys.dir/DependInfo.cmake --color=
  103. :info:build make[2]: Leaving directory `/opt/local/var/macports/build/_opt_local_var_macports_sources_rsync.macports.org_release_tarballs_ports_devel_cmake/cmake/work/cmake-3.3.2'
  104. :info:build /Applications/Xcode.app/Contents/Developer/usr/bin/make -f Utilities/cmcompress/CMakeFiles/cmcompress.dir/build.make Utilities/cmcompress/CMakeFiles/cmcompress.dir/build
  105. :info:build make[2]: Leaving directory `/opt/local/var/macports/build/_opt_local_var_macports_sources_rsync.macports.org_release_tarballs_ports_devel_cmake/cmake/work/cmake-3.3.2'
  106. :info:build /Applications/Xcode.app/Contents/Developer/usr/bin/make -f Utilities/KWIML/test/CMakeFiles/cmIML_test.dir/build.make Utilities/KWIML/test/CMakeFiles/cmIML_test.dir/build
  107. :info:build make[2]: Entering directory `/opt/local/var/macports/build/_opt_local_var_macports_sources_rsync.macports.org_release_tarballs_ports_devel_cmake/cmake/work/cmake-3.3.2'
  108. :info:build make[2]: Nothing to be done for `Utilities/cmcompress/CMakeFiles/cmcompress.dir/build'.
  109. :info:build make[2]: Leaving directory `/opt/local/var/macports/build/_opt_local_var_macports_sources_rsync.macports.org_release_tarballs_ports_devel_cmake/cmake/work/cmake-3.3.2'
  110. :info:build make[2]: Leaving directory `/opt/local/var/macports/build/_opt_local_var_macports_sources_rsync.macports.org_release_tarballs_ports_devel_cmake/cmake/work/cmake-3.3.2'
  111. :info:build /Applications/Xcode.app/Contents/Developer/usr/bin/make -f Source/kwsys/CMakeFiles/cmsys_c.dir/build.make Source/kwsys/CMakeFiles/cmsys_c.dir/build
  112. :info:build make[2]: Entering directory `/opt/local/var/macports/build/_opt_local_var_macports_sources_rsync.macportsease_tarballs_ports_devel_cmake/cmake/work/cmake-3.3.2'
  113. :info:build make[2]: Nothing to be done for `Utilities/KWIML/test/CMakeFiles/cmIML_test.dir/build'.
  114. :info:build make[2]: Leaving directory `/opt/local/var/macports/build/_opt_local_var_macports_sources_rsync.macports.org_release_tarballs_ports_devel_cmake/cmake/work/cmake-3.3.2'
  115. :info:build make[2]: Entering directory `/opt/local/var/macports/build/_opt_local_var_macports_sources_rsync.macports.org_release_tarballs_ports_devel_cmake/cmake/work/cmake-3.3.2'
  116. :info:build make[2]: Nothing to be done for `Source/kwsys/CMakeFiles/cmsys_c.dir/build'.
  117. :info:build make[2]: Leaving directory `/opt/local/var/macports/build/_opt_local_var_macports_sources_rsync.macports.org_release_tarballs_ports_devel_cmake/cmake/work/cmake-3.3.2'
  118. :info:build [  1%] Built target cmcompress
  119. :info:build /Applications/Xcode.app/Contents/Developer/usr/bin/make -f Utilities/cmjsoncpp/CMakeFiles/cmjsoncpp.dir/build.make Utilities/cmjsoncpp/CMakeFiles/cmjsoncpp.dir/depend
  120. :info:build make[2]: Leaving directory `/opt/local/var/macports/build/_opt_local_var_macports_sources_rsync.macports.org_release_tarballs_ports_devel_cmake/cmake/work/cmake-3.3.2'
  121. :
  122. akeFiles/cmcompress.dir/DependInfo.cmake --color=
  123. :info:build make[2]: Entering directory `/opt/local/var/macports/build/_opt_local_var_macports_sources_rsync.macports.org_release_tarballs_ports_devel_cmake/cmake/work/cmake-3.3.2'
  124. :info:build cd /opt/local/var/macports/build/_opt_local_var_macports_sources_rsync.macports.org_release_tarballs_ports_devel_cmake/cmake/work/cmake-3.3.2 && /opt/local/var/macports/build/_opt_local_var_macports_sources_rsync.macports.org_release_tarballs_ports_devel_cmake/cmake/work/cmake-3.3.2/Bootstrap.cmk/cmake -E cmake_depends "Unix Makefiles" /opt/local/var/macports/build/_opt_local_var_macports_sources_rsync.macports.org_release_tarballs_ports_devel_cmake/cmake/work/cmake-3.3.2 /opt/local/var/macports/build/_opt_local_var_macports_sources_rsync.macports.org_release_tarballs_ports_devel_cmake/cmake/work/cmake-3.3.2/Source/kwsys /opt/local/var/macports/build/_opt_local_var_macports_sources_rsync.macports.org_release_tarballs_ports_devel_cmake/cmake/work/cmake-3.3.2 /opt/local/var/macports/build/_opt_local_var_macports_sources_rsync.macports.org_release_tarballs_ports_devel_cmake/cmake/work/cmake-3.3.2/Source/kwsys /opt/local/var/macports/build/_opt_local_var_macports_sources_rsync.macports.org_release_tarballs_ports_devel_cmake/cmake/work/cmake-3.3.2/Source/kwsys/CMakeFiles/cmsys_c.dir/DependInfo.cmake --color=
  125. :info:build make[2]: Entering directory `/opt/local/var/macports/build/_opt_local_var_macports_sources_rsync.macports.org_release_tarballs_ports_devel_cmake/cmake/work/cmake-3.3.2'
  126. :info:build cd /opt/local/var/macports/build/_opt_local_var_macports_sources_rsync.macports.org_release_tarballs_ports_devel_cmake/cmake/work/cmake-3.3.2 && /opt/local/var/macports/build/_opt_local_var_macports_sources_rsync.macports.org_release_tarballs_ports_devel_cmake/cmake/work/cmake-3.3.2/Bootstrap.cmk/cmake -E cmake_depends "Unix Makefiles" /opt/local/var/macports/build/_opt_local_var_macports_sources_rsync.macports.org_release_tarballs_ports_devel_cmake/cmake/work/cmake-3.3.2 /opt/local/var/macports/build/_opt_local_var_macports_sources_rsync.macports.org_release_tarballs_ports_devel_cmake/cmake/work/cmake-3.3.2/Source/kwsys /opt/local/var/macports/build/_opt_local_var_macports_sources_rsync.macports.org_release_tarballs_ports_devel_cmake/cmake/work/cmake-3.3.2 /opt/local/var/macports/build/_opt_local_var_macports_sources_rsync.macports.org_release_tarballs_ports_devel_cmake/cmake/work/cmake-3.3.2/Source/kwsys /opt/local/var/macports/build/_opt_local_var_macports_sources_rsync.macports.org_release_tarballs_ports_devel_cmake/cmake/work/cmake-3.3.2/Source/kwsys/CMakeFiles/cmsys.dir/DependInfo.cmake --color=
  127. :info:build make[2]: Leaving directory `/opt/local/var/macports/build/_opt_local_var_macports_sources_rsync.macports.org_release_tarballs_ports_devel_cmake/cmake/work/cmake-3.3.2'
  128. :info:build /Applications/Xcode.app/Contents/Developer/usr/bin/make -f Utilities/cmcompress/CMakeFiles/cmcompress.dir/build.make Utilities/cmcompress/CMakeFiles/cmcompress.dir/build
  129. :info:build make[2]: Leaving directory `/opt/local/var/macports/build/_opt_local_var_macports_sources_rsync.macports.org_release_tarballs_ports_devel_cmake/cmake/work/cmake-3.3.2'
  130. :info:build /Applications/Xcode.app/Contents/Developer/usr/bin/make -f Utilities/KWIML/test/CMakeFiles/cmIML_test.dir/build.make Utilities/KWIML/test/CMakeFiles/cmIML_test.dir/build
  131. :info:build make[2]: Entering directory `/opt/local/var/macports/build/_opt_local_var_macports_sources_rsync.macports.org_release_tarballs_ports_devel_cmake/cmake/work/cmake-3.3.2'
  132. :info:build make[2]: Nothing to be done for `Utilities/cmcompress/CMakeFiles/cmcompress.dir/build'.
  133. :info:build make[2]: Leaving directory `/opt/local/var/macports/build/_opt_local_var_macports_sources_rsync.macports.org_release_tarballs_ports_devel_cmake/cmake/work/cmake-3.3.2'
  134. :info:build make[2]: Leaving directory `/opt/local/var/macports/build/_opt_local_var_macports_sources_rsync.macports.org_release_tarballs_ports_devel_cmake/cmake/work/cmake-3.3.2'
  135. :info:build /Applications/Xcode.app/Contents/Developer/usr/bin/make -f Source/kwsys/CMakeFiles/cmsys_c.dir/build.make Source/kwsys/CMakeFiles/cmsys_c.dir/build
  136. :info:build make[2]: Entering directory `/opt/local/var/macports/build/_opt_local_var_macports_sources_rsync.macports.org_release_tarballs_ports_devel_cmake/cmake/work/cmake-3.3.2'
  137. :info:build make[2]: Nothing to be done for `Utilities/KWIML/test/CMakeFiles/cmIML_test.dir/build'.
  138. :info:build make[2]: Leaving directory `/opt/local/var/macports/build/_opt_local_var_macports_sources_rsync.macports.org_release_tarballs_ports_devel_cmake/cmake/work/cmake-3.3.2'
  139. :info:build make[2]: Entering directory `/opt/local/var/macports/build/_opt_local_var_macports_sources_rsync.macports.org_release_tarballs_ports_devel_cmake/cmake/work/cmake-3.3.2'
  140. :info:build make[2]: Nothing to be done for `Source/kwsys/CMakeFiles/cmsys_c.dir/build'.
  141. :info:build make[2]: Leaving directory `/opt/local/var/macports/build/_opt_local_var_macports_sources_rsync.macports.org_release_tarballs_ports_devel_cmake/cmake/work/cmake-3.3.2'
  142. :info:build [  1%] Built target cmcompress
  143. :info:build /Applications/Xcode.app/Contents/Developer/usr/bin/make -f Utilities/cmjsoncpp/CMakeFiles/cmjsoncpp.dir/build.make Utilities/cmjsoncpp/CMakeFiles/cmjsoncpp.dir/depend
  144. :info:build make[2]: Leaving directory `/opt/local/var/macports/build/_opt_local_var_macports_sources_rsync.macports.org_release_tarballs_ports_devel_cmake/cmake/work/cmake-3.3.2'
  145. :info:build /Applications/Xcode.app/Contents/Developer/usr/bin/make -f Source/kwsys/CMakeFiles/cmsys.dir/build.make Source/kwsys/CMakeFiles/cmsys.dir/build
  146. :
  147. akeFiles/cmcompress.dir/DependInfo.cmake --color=
  148. :info:build make[2]: Entering directory `/opt/local/var/macports/build/_opt_local_var_macports_sources_rsync.macports.org_release_tarballs_ports_devel_cmake/cmake/work/cmake-3.3.2'
  149. :info:build cd /opt/local/var/macports/build/_opt_local_var_macports_sources_rsync.macports.org_release_tarballs_ports_devel_cmake/cmake/work/cmake-3.3.2 && /opt/local/var/macports/build/_opt_local_var_macports_sources_rsync.macports.org_release_tarballs_ports_devel_cmake/cmake/work/cmake-3.3.2/Bootstrap.cmk/cmake -E cmake_depends "Unix Makefiles" /opt/local/var/macports/build/_opt_local_var_macports_sources_rsync.macports.org_release_tarballs_ports_devel_cmake/cmake/work/cmake-3.3.2 /opt/local/var/macports/build/_opt_local_var_macports_sources_rsync.macports.org_release_tarballs_ports_devel_cmake/cmake/work/cmake-3.3.2/Source/kwsys /opt/local/var/macports/build/_opt_local_var_macports_sources_rsync.macports.org_release_tarballs_ports_devel_cmake/cmake/work/cmake-3.3.2 /opt/local/var/macports/build/_opt_local_var_macports_sources_rsync.macports.org_release_tarballs_ports_devel_cmake/cmake/work/cmake-3.3.2/Source/kwsys /opt/local/var/macports/build/_opt_local_var_macports_sources_rsync.macports.org_release_tarballs_ports_devel_cmake/cmake/work/cmake-3.3.2/Source/kwsys/CMakeFiles/cmsys_c.dir/DependInfo.cmake --color=
  150. :info:build make[2]: Entering directory `/opt/local/var/macports/build/_opt_local_var_macports_sources_rsync.macports.org_release_tarballs_ports_devel_cmake/cmake/work/cmake-3.3.2'
  151. :info:build cd /opt/local/var/macports/build/_opt_local_var_macports_sources_rsync.macports.org_release_tarballs_ports_devel_cmake/cmake/work/cmake-3.3.2 && /opt/local/var/macports/build/_opt_local_var_macports_sources_rsync.macports.org_release_tarballs_ports_devel_cmake/cmake/work/cmake-3.3.2/Bootstrap.cmk/cmake -E cmake_depends "Unix Makefiles" /opt/local/var/macports/build/_opt_local_var_macports_sources_rsync.macports.org_release_tarballs_ports_devel_cmake/cmake/work/cmake-3.3.2 /opt/local/var/macports/build/_opt_local_var_macports_sources_rsync.macports.org_release_tarballs_ports_devel_cmake/cmake/work/cmake-3.3.2/Source/kwsys /opt/local/var/macports/build/_opt_local_var_macports_sources_rsync.macports.org_release_tarballs_ports_devel_cmake/cmake/work/cmake-3.3.2 /opt/local/var/macports/build/_opt_local_var_macports_sources_rsync.macports.org_release_tarballs_ports_devel_cmake/cmake/work/cmake-3.3.2/Source/kwsys /opt/local/var/macports/build/_opt_local_var_macports_sources_rsync.macports.org_release_tarballs_ports_devel_cmake/cmake/work/cmake-3.3.2/Source/kwsys/CMakeFiles/cmsys.dir/DependInfo.cmake --color=
  152. :info:build make[2]: Leaving directory `/opt/local/var/macports/build/_opt_local_var_macports_sources_rsync.macports.org_release_tarballs_ports_devel_cmake/cmake/work/cmake-3.3.2'
  153. :info:build /Applications/Xcode.app/Contents/Developer/usr/bin/make -f Utilities/cmcompress/CMakeFiles/cmcompress.dir/build.make Utilities/cmcompress/CMakeFiles/cmcompress.dir/build
  154. :info:build make[2]: Leaving directory `/opt/local/var/macports/build/_opt_local_var_macports_sources_rsync.macports.org_release_tarballs_ports_devel_cmake/cmake/work/cmake-3.3.2'
  155. :info:build /Applications/Xcode.app/Contents/Developer/usr/bin/make -f Utilities/KWIML/test/CMakeFiles/cmIML_test.dir/build.make Utilities/KWIML/test/CMakeFiles/cmIML_test.dir/build
  156. :info:build make[2]: Entering directory `/opt/local/var/macports/build/_opt_local_var_macports_sources_rsync.macports.org_release_tarballs_ports_devel_cmake/cmake/work/cmake-3.3.2'
  157. :info:build make[2]: Nothing to be done for `Utilities/cmcompress/CMakeFiles/cmcompress.dir/build'.
  158. :info:build make[2]: Leaving directory `/opt/local/var/macports/build/_opt_local_var_macports_sources_rsync.macports.org_release_tarballs_ports_devel_cmake/cmake/work/cmake-3.3.2'
  159. :info:build make[2]: Leaving directory `/opt/local/var/macports/build/_opt_local_var_macports_sources_rsync.macports.org_release_tarballs_ports_devel_cmake/cmake/work/cmake-3.3.2'
  160. :info:buications/Xcode.app/Contents/Developer/usr/bin/make -f Source/kwsys/CMakeFiles/cmsys_c.dir/build.make Source/kwsys/CMakeFiles/cmsys_c.dir/build
  161. :info:build make[2]: Entering directory `/opt/local/var/macports/build/_opt_local_var_macports_sources_rsync.macports.org_release_tarballs_ports_devel_cmake/cmake/work/cmake-3.3.2'
  162. :info:build make[2]: Nothing to be done for `Utilities/KWIML/test/CMakeFiles/cmIML_test.dir/build'.
  163. :info:build make[2]: Leaving directory `/opt/local/var/macports/build/_opt_local_var_macports_sources_rsync.macports.org_release_tarballs_ports_devel_cmake/cmake/work/cmake-3.3.2'
  164. :info:build make[2]: Entering directory `/opt/local/var/macports/build/_opt_local_var_macports_sources_rsync.macports.org_release_tarballs_ports_devel_cmake/cmake/work/cmake-3.3.2'
  165. :info:build make[2]: Nothing to be done for `Source/kwsys/CMakeFiles/cmsys_c.dir/build'.
  166. :info:build make[2]: Leaving directory `/opt/local/var/macports/build/_opt_local_var_macports_sources_rsync.macports.org_release_tarballs_ports_devel_cmake/cmake/work/cmake-3.3.2'
  167. :info:build [  1%] Built target cmcompress
  168. :info:build /Applications/Xcode.app/Contents/Developer/usr/bin/make -f Utilities/cmjsoncpp/CMakeFiles/cmjsoncpp.dir/build.make Utilities/cmjsoncpp/CMakeFiles/cmjsoncpp.dir/depend
  169. :info:build make[2]: Leaving directory `/opt/local/var/macports/build/_opt_local_var_macports_sources_rsync.macports.org_release_tarballs_ports_devel_cmake/cmake/work/cmake-3.3.2'
  170. :info:build /Applications/Xcode.app/Contents/Developer/usr/bin/make -f Source/kwsys/CMakeFiles/cmsys.dir/build.make Source/kwsys/CMakeFiles/cmsys.dir/build
  171. :
  172. akeFiles/cmcompress.dir/DependInfo.cmake --color=
  173. :info:build make[2]: Entering directory `/opt/local/var/macports/build/_opt_local_var_macports_sources_rsync.macports.org_release_tarballs_ports_devel_cmake/cmake/work/cmake-3.3.2'
  174. :info:build cd /opt/local/var/macports/build/_opt_local_var_macports_sources_rsync.macports.org_release_tarballs_ports_devel_cmake/cmake/work/cmake-3.3.2 && /opt/local/var/macports/build/_opt_local_var_macports_sources_rsync.macports.org_release_tarballs_ports_devel_cmake/cmake/work/cmake-3.3.2/Bootstrap.cmk/cmake -E cmake_depends "Unix Makefiles" /opt/local/var/macports/build/_opt_local_var_macports_sources_rsync.macports.org_release_tarballs_ports_devel_cmake/cmake/work/cmake-3.3.2 /opt/local/var/macports/build/_opt_local_var_macports_sources_rsync.macports.org_release_tarballs_ports_devel_cmake/cmake/work/cmake-3.3.2/Source/kwsys /opt/local/var/macports/build/_opt_local_var_macports_sources_rsync.macports.org_release_tarballs_ports_devel_cmake/cmake/work/cmake-3.3.2 /opt/local/var/macports/build/_opt_local_var_macports_sources_rsync.macports.org_release_tarballs_ports_devel_cmake/cmake/work/cmake-3.3.2/Source/kwsys /opt/local/var/macports/build/_opt_local_var_macports_sources_rsync.macports.org_release_tarballs_ports_devel_cmake/cmake/work/cmake-3.3.2/Source/kwsys/CMakeFiles/cmsys_c.dir/DependInfo.cmake --color=
  175. :info:build make[2]: Entering directory `/opt/local/var/macports/build/_opt_local_var_macports_sources_rsync.macports.org_release_tarballs_ports_devel_cmake/cmake/work/cmake-3.3.2'
  176. :info:build cd /opt/local/var/macports/build/_opt_local_var_macports_sources_rsync.macports.org_release_tarballs_ports_devel_cmake/cmake/work/cmake-3.3.2 && /opt/local/var/macports/build/_opt_local_var_macports_sources_rsync.macports.org_release_tarballs_ports_devel_cmake/cmake/work/cmake-3.3.2/Bootstrap.cmk/cmake -E cmake_depends "Unix Makefiles" /opt/local/var/macports/build/_opt_local_var_macports_sources_rsync.macports.org_release_tarballs_ports_devel_cmake/cmake/work/cmake-3.3.2 /opt/local/var/macports/build/_opt_local_var_macports_sources_rsync.macports.org_release_tarballs_ports_devel_cmake/cmake/work/cmake-3.3.2/Source/kwsys /opt/local/var/macports/build/_opt_local_var_macports_sources_rsync.macports.org_release_tarballs_ports_devel_cmake/cmake/work/cmake-3.3.2 /opt/local/var/macports/build/_opt_local_var_macports_sources_rsync.macports.org_release_tarballs_ports_devel_cmake/cmake/work/cmake-3.3.2/Source/kwsys /opt/local/var/macports/build/_opt_local_var_macports_sources_rsync.macports.org_release_tarballs_ports_devel_cmake/cmake/work/cmake-3.3.2/Source/kwsys/CMakeFiles/cmsys.dir/DependInfo.cmake --color=
  177. :info:build make[2]: Leaving directory `/opt/local/var/macports/build/_opt_local_var_macports_sources_rsync.macports.org_release_tarballs_ports_devel_cmake/cmake/work/cmake-3.3.2'
  178. :info:build /Applications/Xcode.app/Contents/Developer/usr/bin/make -f Utilities/cmcompress/CMakeFiles/cmcompress.dir/build.make Utilities/cmcompress/CMakeFiles/cmcompress.dir/build
  179. :info:build make[2]: Leaving directory `/opt/local/var/macports/build/_opt_local_var_macports_sources_rsync.macports.org_release_tarballs_ports_devel_cmake/cmake/work/cmake-3.3.2'
  180. :info:build /Applications/Xcode.app/Contents/Developer/usr/bin/make -f Utilities/KWIML/test/CMakeFiles/cmIML_test.dir/build.make Utilities/KWIML/test/CMakeFiles/cmIML_test.dir/build
  181. :info:build make[2]: Entering directory `/opt/local/var/macports/build/_opt_local_var_macports_sources_rsync.macports.org_release_tarballs_ports_devel_cmake/cmake/work/cmake-3.3.2'
  182. :info:build make[2]: Nothing to be done for `Utilities/cmcompress/CMakeFiles/cmcompress.dir/build'.
  183. :info:build make[2]: Leaving directory `/opt/local/var/macports/build/_opt_local_var_macports_sources_rsync.macports.org_release_tarballs_ports_devel_cmake/cmake/work/cmake-3.3.2'
  184. :info:build make[2]: Leaving directory `/opt/local/var/macports/build/_opt_local_var_macports_sources_rsync.macports.org_release_tarballs_ports_devel_cmake/cmake/work/cmake-3.3.2'
  185. :info:build /Applications/Xcode.app/Contents/Developer/usr/bin/make -f Source/kwsys/CMakeFiles/cmsys_c.dir/build.make Source/kwsys/CMakeFiles/cmsys_c.dir/build
  186. :info:build make[2]: Entering directory `/opt/local/var/macports/build/_opt_local_var_macports_sources_rsync.macports.org_release_tarballs_ports_devel_cmake/cmake/work/cmake-3.3.2'
  187. :info:build make[2]: Nothing to be done for `Utilities/KWIML/test/CMakeFiles/cmIML_test.dir/build'.
  188. :info:build make[2]: Leaving directory `/opt/local/var/macports/build/_opt_local_var_macports_sources_rsync.macports.org_release_tarballs_ports_devel_cmake/cmake/work/cmake-3.3.2'
  189. :info:build make[2]: Entering directory `/opt/local/var/macports/build/_opt_local_var_macports_sources_rsync.macports.org_release_tarballs_ports_devel_cmake/cmake/work/cmake-3.3.2'
  190. :info:build make[2]: Nothing to be done for `Source/kwsys/CMakeFiles/cmsys_c.dir/build'.
  191. :info:build make[2]: Leaving directory `/opt/local/var/macports/build/_opt_local_var_macports_sources_rsync.macports.org_release_tarballs_ports_devel_cmake/cmake/work/cmake-3.3.2'
  192. :info:build [  1%] Built target cmcompress
  193. :info:build /Applications/Xcode.app/Contents/Developer/usr/bin/make -f Utilities/cmjsoncpp/CMakeFiles/cmjsoncpp.dir/build.make Utilities/cmjsoncpp/CMakeFiles/cmjsoncpp.dir/depend
  194. :info:build make[2]: Leaving directory `/opt/local/var/macports/build/_opt_local_var_macports_sources_rsync.macports.org_release_tarballs_ports_devel_cmake/cmake/work/cmake-3.3.2'
  195. :info:build /Applications/Xcode.app/Contents/Developer/usr/bin/make -f Source/kwsys/CMakeFiles/cmsys.dir/build.make Source/kwsys/CMakeFiles/cmsys.dir/build
  196. :info:build [  3%] Built target cmIML_test
  197. :info:build /Applications/Xcode.app/Contents/Developer/usr/bin/make -f Tests/CMakeLib/PseudoMemcheck/NoLog/CMakeFiles/pseudonl_BC.dir/build.make Tests/CMakeLib/PseudoMemcheck/NoLog/CMakeFiles/pseudonl_BC.dir/depend
  198. :info:build make[2]: Entering directory `/opt/local/var/macports/build/_opt_local_var_macports_sources_rsync.macports.org_release_tarballs_ports_devel_cmake/cmake/work/cmake-3.3.2'
  199. :info:build cd /opt/local/var/macports/build/_opt_local_var_macports_sources_rsync.macports.org_release_tarballs_ports_devel_cmake/cmake/work/cmake-3.3.2 && /opt/local/var/macports/build/_opt_local_var_macports_sources_rsync.macports.org_release_tarballs_ports_devel_cmake/cmake/work/cmake-3.3.2/Bootstrap.cmk/cmake -E cmake_depends "Unix Makefiles" /opt/local/var/macports/build/_opt_local_var_macports_sources_rsync.macports.org_release_tarballs_ports_devel_cmake/cmake/work/cmake-3.3.2 /opt/local/var/macports/build/_opt_local_var_macports_sources_rsync.macports.org_release_tarballs_ports_devel_cmake/cmake/work/cmake-3.3.2/Utilities/cmjsoncpp /opt/local/var/macports/build/_opt_local_var_macports_sources_rsync.macports.org_release_tarballs_ports_devel_cmake/cmake/work/cmake-3.3.2 /opt/local/var/macports/build/_opt_local_var_macports_sources_rsync.macports.org_release_tarballs_ports_devel_cmake/cmake/work/cmake-3.3.2/Utilities/cmjsoncpp /opt/local/var/macports/build/_opt_local_var_macports_sources_rsync.macports.org_release_tarballs_ports_devel_cmake/cmake/work/cmake-3.3.2/Utilities/cmjsoncpp/CMakeFiles/cmjsoncpp.dir/DependInfo.cmake --color=
  200. :info:build [  5%] Built target cmsys_c
  201. :info:build make[2]: Entering directory `/opt/local/var/macports/build/_opt_local_var_macports_sources_rsync.macports.org_release_tarballs_ports_devel_cmake/cmake/work/cmake-3.3.2'
  202. :info:build cd /opt/local/var/macports/build/_opt_local_var_macports_sources_rsync.macports.org_release_tarballs_ports_devel_cmake/cmake/work/cmake-3.3.2 && /opt/local/var/macports/build/_opt_local_var_macports_sources_rsync.macports.org_release_tarballs_ports_devel_cmake/cmake/work/cmake-3.3.2/Bootstrap.cmk/cmake -E cmake_depends "Unix Makefiles" /opt/local/var/macports/build/_opt_local_var_macports_sources_rsync.macports.org_release_tarballs_ports_devel_cmake/cmake/work/cmake-3.3.2 /opt/local/var/macports/build/_opt_local_var_macports_sources_rsync.macports.org_release_tarballs_ports_devel_cmake/cmake/work/cmake-3.3.2/Tests/CMakeLib/PseudoMemcheck/NoLog /opt/local/var/macports/build/_opt_local_var_macports_sources_rsync.macports.org_release_tarballs_ports_devel_cmake/cmake/work/cmake-3.3.2 /opt/local/var/macports/build/_opt_local_var_macports_sources_rsync.macports.org_release_tarballs_ports_devel_cmake/cmake/work/cmake-3.3.2/Tests/CMakeLib/PseudoMemcheck/NoLog /opt/local/var/macports/build/_opt_local_var_macports_sources_rsync.macports.org_release_tarballs_ports_devel_cmake/cmake/work/cmake-3.3.2/Tests/CMakeLib/PseudoMemcheck/NoLog/CMakeFiles/pseudonl_BC.dir/DependInfo.cmake --color=
  203. :info:build /Applications/Xcode.app/Contents/Developer/usr/bin/make -f Tests/CMakeLib/PseudoMemcheck/NoLog/CMakeFiles/pseudonl_purify.dir/build.make Tests/CMakeLib/PseudoMemcheck/NoLog/CMakeFiles/pseudonl_purify.dir/depend
  204. :info:build make[2]: Entering directory `/opt/local/var/macports/build/_opt_local_var_macports_sources_rsync.macports.org_release_tarballs_ports_devel_cmake/cmake/work/cmake-3.3.2'
  205. :info:build make[2]: Nothing to be done for `Source/kwsys/CMakeFiles/cmsys.dir/build'.
  206. :info:build make[2]: Leaving directory `/opt/local/var/macports/build/_opt_local_var_macports_sources_rsync.macports.org_release_tarballs_ports_devel_cmake/cmake/work/cmake-3.3.2'
  207. :info:build make[2]: Entering directory `/opt/local/var/macports/build/_opt_local_var_macports_sources_rsync.macports.org_release_tarballs_ports_devel_cmake/cmake/work/cmake-3.3.2'
  208. :info:build cd /opt/local/var/macports/build/_opt_local_var_macports_sources_rsync.macports.org_release_tarballs_ports_devel_cmake/cmake/work/cmake-3.3.2 && /opt/local/var/macports/build/_opt_local_var_macports_sources_rsync.macports.org_release_tarballs_ports_devel_cmake/cmake/work/cmake-3.3.2/Bootstrap.cmk/cmake -E cmake_depends "Unix Makefiles" /opt/local/var/macports/build/_opt_local_var_macports_sources_rsync.macports.org_release_tarballs_ports_devel_cmake/cmake/work/cmake-3.3.2 /opt/local/var/macports/build/_opt_local_var_macports_sources_rsync.macports.org_release_tarballs_ports_devel_cmake/cmake/work/cmake-3.3.2/Tests/CMakeLib/PseudoMemcheck/NoLog /opt/local/var/macports/build/_opt_local_var_macports_sources_rsync.macports.org_release_tarballs_ports_devel_cmake/cmake/work/cmake-3.3.2 /opt/local/var/macports/build/_opt_local_var_macports_sources_rsync.macports.org_release_tarballs_ports_devel_cmake/cmake/work/cmake-3.3.2/Tests/CMakeLib/PseudoMemcheck/NoLog /opt/local/var/macports/build/_opt_local_var_macports_sources_rsync.macports.org_release_tarballs_ports_devel_cmake/cmake/work/cmake-3.3.2/Tests/CMakeLib/PseudoMemcheck/NoLog/CMakeFiles/pseudonl_purify.dir/DependInfo.cmake --color=
  209. :info:build [ 11%] Built target cmsys
  210. :info:build /Applications/Xcode.app/Contents/Developer/usr/bin/make -f Tests/CMakeLib/PseudoMemcheck/NoLog/CMakeFiles/pseudonl_valgrind.dir/build.make Tests/CMakeLib/PseudoMemcheck/NoLog/CMakeFiles/pseudonl_valgrind.dir/depend
  211. :info:build make[2]: Leaving directory `/opt/local/var/macports/build/_opt_local_var_macports_sources_rsync.macports.org_release_tarballs_ports_devel_cmake/cmake/work/cmake-3.3.2'
  212. :info:build make[2]: Leaving directory `/opt/local/var/macports/build/_opt_local_var_macports_sources_rsync.macports.org_release_tarballs_ports_devel_cmake/cmake/work/cmake-3.3.2'
  213. :info:build /Applications/Xcode.app/Contents/Developer/usr/bin/make -f Tests/CMakeLib/PseudoMemcheck/NoLog/CMakeFiles/pseudonl_BC.dir/build.make Tests/CMakeLib/PseudoMemcheck/NoLog/CMakeFiles/pseudonl_BC.dir/build
  214. :info:build /Applications/Xcode.app/Contents/Developer/usr/bin/make -f Utilities/cmjsoncpp/CMakeFiles/cmjsoncpp.dir/build.make Utilities/cmjsoncpp/CMakeFiles/cmjsoncpp.dir/build
  215. :info:build make[2]: Entering directory `/opt/local/var/macports/build/_opt_local_var_macports_sources_rsync.macports.org_release_tarballs_ports_devel_cmake/cmake/work/cmake-3.3.2'
  216. :info:build make[2]: Nothing to be done for `Tests/CMakeLib/PseudoMemcheck/NoLog/CMakeFiles/pseudonl_BC.dir/build'.
  217. :info:build make[2]: Leaving directory `/opt/local/var/macports/build/_opt_local_var_macports_sources_rsync.macports.org_release_tarballs_ports_devel_cmake/cmake/work/cmake-3.3.2'
  218. :info:build make[2]: Leaving directory `/opt/local/var/macports/build/_opt_local_var_macports_sources_rsync.macports.org_release_tarballs_ports_devel_cmake/cmake/work/cmake-3.3.2'
  219. :info:build make[2]: Entering directory `/opt/local/var/macports/build/_opt_local_var_macports_sources_rsync.macports.org_release_tarballs_ports_devel_cmake/cmake/work/cmake-3.3.2'
  220. :info:build cd /opt/local/var/macports/build/_opt_local_var_macports_sources_rsync.macports.org_release_tarballs_ports_devel_cmake/cmake/work/cmake-3.3.2 && /opt/local/var/macports/build/_opt_local_var_macports_sources_rsync.macports.org_release_tarballs_ports_devel_cmake/cmake/work/cmake-3.3.2/Bootstrap.cmk/cmake -E cmake_depends "Unix Makefiles" /opt/local/var/macports/build/_opt_local_var_macports_sources_rsync.macports.org_release_tarballs_ports_devel_cmake/cmake/work/cmake-3.3.2 /opt/local/var/macports/build/_opt_local_var_macports_sources_rsync.macports.org_release_tarballs_ports_devel_cmake/cmake/work/cmake-3.3.2/Tests/CMakeLib/PseudoMemcheck/NoLog /opt/local/var/macports/build/_opt_local_var_macports_sources_rsync.macports.org_release_tarballs_ports_devel_cmake/cmake/work/cmake-3.3.2 /opt/local/var/macports/build/_opt_local_var_macports_sources_rsync.macports.org_release_tarballs_ports_devel_cmake/cmake/work/cmake-3.3.2/Tests/CMakeLib/PseudoMemcheck/NoLog /opt/local/var/macports/build/_opt_local_var_macports_sources_rsync.macports.org_release_tarballs_ports_devel_cmake/cmake/work/cmake-3.3.2/Tests/CMakeLib/PseudoMemcheck/NoLog/CMakeFiles/pseudonl_valgrind.dir/DependInfo.cmake --color=
  221. :info:build /Applications/Xcode.app/Contents/Developer/usr/bin/make -f Tests/CMakeLib/PseudoMemcheck/NoLog/CMakeFiles/pseudonl_purify.dir/build.make Tests/CMakeLib/PseudoMemcheck/NoLog/CMakeFiles/pseudonl_purify.dir/build
  222. :info:build make[2]: Entering directory `/opt/local/var/macports/build/_opt_local_var_macports_sources_rsync.macports.org_release_tarballs_ports_devel_cmake/cmake/work/cmake-3.3.2'
  223. :info:build make[2]: Nothing to be done for `Utilities/cmjsoncpp/CMakeFiles/cmjsoncpp.dir/build'.
  224. :info:build make[2]: Leaving directory `/opt/local/var/macports/build/_opt_local_var_macports_sources_rsync.macports.org_release_tarballs_ports_devel_cmake/cmake/work/cmake-3.3.2'
  225. :info:build make[2]: Entering directory `/opt/local/var/macports/build/_opt_local_var_macports_sources_rsync.macports.org_release_tarballs_ports_devel_cmake/cmake/work/cmake-3.3.2'
  226. :info:build make[2]: Nothing to be done for `Tests/CMakeLib/PseudoMemcheck/NoLog/CMakeFiles/pseudonl_purify.dir/build'.
  227. :info:build make[2]: Leaving directory `/opt/local/var/macports/build/_opt_local_var_macports_sources_rsync.macports.org_release_tarballs_ports_devel_cmake/cmake/work/cmake-3.3.2'
  228. :info:build [ 12%] Built target pseudonl_BC
  229. :info:build /Applications/Xcode.app/Contents/Developer/usr/bin/make -f Tests/RunCMake/CMakeFiles/pseudo_emulator.dir/build.make Tests/RunCMake/CMakeFiles/pseudo_emulator.dir/depend
  230. :info:build [ 13%] Built target cmjsoncpp
  231. :info:build /Applications/Xcode.app/Contents/Developer/usr/bin/make -f Tests/RunCMake/CMakeFiles/pseudo_iwyu.dir/build.make Tests/RunCMake/CMakeFiles/pseudo_iwyu.dir/depend
  232. :info:build make[2]: Leaving directory `/opt/local/var/macports/build/_opt_local_var_macports_sources_rsync.macports.org_release_tarballs_ports_devel_cmake/cmake/work/cmake-3.3.2'
  233. :info:build /Applications/Xcode.app/Contents/Developer/usr/bin/make -f Tests/CMakeLib/PseudoMemcheck/NoLog/CMakeFiles/pseudonl_valgrind.dir/build.make Tests/CMakeLib/PseudoMemcheck/NoLog/CMakeFiles/pseudonl_valgrind.dir/build
  234. :info:build make[2]: Entering directory `/opt/local/var/macports/build/_opt_local_var_macports_sources_rsync.macports.org_release_tarballs_ports_devel_cmake/cmake/work/cmake-3.3.2'
  235. :info:build cd /opt/local/var/macports/build/_opt_local_var_macports_sources_rsync.macports.org_release_tarballs_ports_devel_cmake/cmake/work/cmake-3.3.2 && /opt/local/var/macports/build/_opt_local_var_macports_sources_rsync.macports.org_release_tarballs_ports_devel_cmake/cmake/work/cmake-3.3.2/Bootstrap.cmk/cmake -E cmake_depends "Unix Makefiles" /opt/local/var/macports/build/_opt_local_var_macports_sources_rsync.macports.org_release_tarballs_ports_devel_cmake/cmake/work/cmake-3.3.2 /opt/local/var/macports/build/_opt_local_var_macports_sources_rsync.macports.org_release_tarballs_ports_devel_cmake/cmake/work/cmake-3.3.2/Tests/RunCMake /opt/local/var/macports/build/_opt_local_var_macports_sources_rsync.macports.org_release_tarballs_ports_devel_cmake/cmake/work/cmake-3.3.2 /opt/local/var/macports/build/_opt_local_var_macports_sources_rsync.macports.org_release_tarballs_ports_devel_cmake/cmake/work/cmake-3.3.2/Tests/RunCMake /opt/local/var/macports/build/_opt_local_var_macports_sources_rsync.macports.org_release_tarballs_ports_devel_cmake/cmake/work/cmake-3.3.2/Tests/RunCMake/CMakeFiles/pseudo_emulator.dir/DependInfo.cmake --color=
  236. :info:build [ 13%] Built target pseudonl_purify
  237. :info:build /Applications/Xcode.app/Contents/Developer/usr/bin/make -f Tests/FindPackageModeMakefileTest/CMakeFiles/foo.dir/build.make Tests/FindPackageModeMakefileTest/CMakeFiles/foo.dir/depend
  238. :info:build make[2]: Entering directory `/opt/local/var/macports/build/_opt_local_var_macports_sources_rsync.macports.org_release_tarballs_ports_devel_cmake/cmake/work/cmake-3.3.2'
  239. :info:build cd /opt/local/var/macports/build/_opt_local_var_macports_sources_rsync.macports.org_release_tarballs_ports_devel_cmake/cmake/work/cmake-3.3.2 && /opt/local/var/macports/build/_opt_local_var_macports_sources_rsync.macports.org_release_tarballs_ports_devel_cmake/cmake/work/cmake-3.3.2/Bootstrap.cmk/cmake -E cmake_depends "Unix Makefiles" /opt/local/var/macports/build/_opt_local_var_macports_sources_rsync.macports.org_release_tarballs_ports_devel_cmake/cmake/work/cmake-3.3.2 /opt/local/var/macports/build/_opt_local_var_macports_sources_rsync.macports.org_release_tarballs_ports_devel_cmake/cmake/work/cmake-3.3.2/Tests/RunCMake /opt/local/var/macports/build/_opt_local_var_macports_sources_rsync.macports.org_release_tarballs_ports_devel_cmake/cmake/work/cmake-3.3.2 /opt/local/var/macports/build/_opt_local_var_macports_sources_rsync.macports.org_release_tarballs_ports_devel_cmake/cmake/work/cmake-3.3.2/Tests/RunCMake /opt/local/var/macports/build/_opt_local_var_macports_sources_rsync.macports.org_release_tarballs_ports_devel_cmake/cmake/work/cmake-3.3.2/Tests/RunCMake/CMakeFiles/pseudo_iwyu.dir/DependInfo.cmake --color=
  240. :info:build make[2]: Entering directory `/opt/local/var/macports/build/_opt_local_var_macports_sources_rsync.macports.org_release_tarballs_ports_devel_cmake/cmake/work/cmake-3.3.2'
  241. :info:build make[2]: Nothing to be done for `Tests/CMakeLib/PseudoMemcheck/NoLog/CMakeFiles/pseudonl_valgrind.dir/build'.
  242. :info:build make[2]: Leaving directory `/opt/local/var/macports/build/_opt_local_var_macports_sources_rsync.macports.org_release_tarballs_ports_devel_cmake/cmake/work/cmake-3.3.2'
  243. :info:build make[2]: Entering directory `/opt/local/var/macports/build/_opt_local_var_macports_sources_rsync.macports.org_release_tarballs_ports_devel_cmake/cmake/work/cmake-3.3.2'
  244. :info:build cd /opt/local/var/macports/build/_opt_local_var_macports_sources_rsync.macports.org_release_tarballs_ports_devel_cmake/cmake/work/cmake-3.3.2 && /opt/local/var/macports/build/_opt_local_var_macports_sources_rsync.macports.org_release_tarballs_ports_devel_cmake/cmake/work/cmake-3.3.2/Bootstrap.cmk/cmake -E cmake_depends "Unix Makefiles" /opt/local/var/macports/build/_opt_local_var_macports_sources_rsync.macports.org_release_tarballs_ports_devel_cmake/cmake/work/cmake-3.3.2 /opt/local/var/macports/build/_opt_local_var_macports_sources_rsync.macports.org_release_tarballs_ports_devel_cmake/cmake/work/cmake-3.3.2/Tests/FindPackageModeMakefileTest /opt/local/var/macports/build/_opt_local_var_macports_sources_rsync.macports.org_release_tarballs_ports_devel_cmake/cmake/work/cmake-3.3.2 /opt/local/var/macports/build/_opt_local_var_macports_sources_rsync.macports.org_release_tarballs_ports_devel_cmake/cmake/work/cmake-3.3.2/Tests/FindPackageModeMakefileTest /opt/local/var/macports/build/_opt_local_var_macports_sources_rsync.macports.org_release_tarballs_ports_devel_cmake/cmake/work/cmake-3.3.2/Tests/FindPackageModeMakefileTest/CMakeFiles/foo.dir/DependInfo.cmake --color=
  245. :info:build [ 14%] Built target pseudonl_valgrind
  246. :info:build /Applications/Xcode.app/Contents/Developer/usr/bin/make -f Source/kwsys/CMakeFiles/cmsysTestDynload.dir/build.make Source/kwsys/CMakeFiles/cmsysTestDynload.dir/depend
  247. :info:build make[2]: Leaving directory `/opt/local/var/macports/build/_opt_local_var_macports_sources_rsync.macports.org_release_tarballs_ports_devel_cmake/cmake/work/cmake-3.3.2'
  248. :info:build /Applications/Xcode.app/Contents/Developer/usr/bin/make -f Tests/RunCMake/CMakeFiles/pseudo_emulator.dir/build.make Tests/RunCMake/CMakeFiles/pseudo_emulator.dir/build
  249. :info:build make[2]: Leaving directory `/opt/local/var/macports/build/_opt_local_var_macports_sources_rsync.macports.org_release_tarballs_ports_devel_cmake/cmake/work/cmake-3.3.2'
  250. :info:build /Applications/Xcode.app/Contents/Developer/usr/bin/make -f Tests/RunCMake/CMakeFiles/pseudo_iwyu.dir/build.make Tests/RunCMake/CMakeFiles/pseudo_iwyu.dir/build
  251. :info:build make[2]: Entering directory `/opt/local/var/macports/build/_opt_local_var_macports_sources_rsync.macports.org_release_tarballs_ports_devel_cmake/cmake/work/cmake-3.3.2'
  252. :info:build make[2]: Nothing to be done for `Tests/RunCMake/CMakeFiles/pseudo_emulator.dir/build'.
  253. :info:build make[2]: Leaving directory `/opt/local/var/macports/build/_opt_local_var_macports_sources_rsync.macports.org_release_tarballs_ports_devel_cmake/cmake/work/cmake-3.3.2'
  254. :info:build make[2]: Leaving directory `/opt/local/var/macports/build/_opt_local_var_macports_sources_rsync.macports.org_release_tarballs_ports_devel_cmake/cmake/work/cmake-3.3.2'
  255. :info:build make[2]: Entering directory `/opt/local/var/macports/build/_opt_local_var_macports_sources_rsync.macports.org_release_tarballs_ports_devel_cmake/cmake/work/cmake-3.3.2'
  256. :info:build cd /opt/local/var/macports/build/_opt_local_var_macports_sources_rsync.macports.org_release_tarballs_ports_devel_cmake/cmake/work/cmake-3.3.2 && /opt/local/var/macports/build/_opt_local_var_macports_sources_rsync.macports.org_release_tarballs_ports_devel_cmake/cmake/work/cmake-3.3.2/Bootstrap.cmk/cmake -E cmake_depends "Unix Makefiles" /opt/local/var/macports/build/_opt_local_var_macports_sources_rsync.macports.org_release_tarballs_ports_devel_cmake/cmake/work/cmake-3.3.2 /opt/local/var/macports/build/_opt_local_var_macports_sources_rsync.macports.org_release_tarballs_ports_devel_cmake/cmake/work/cmake-3.3.2/Source/kwsys /opt/local/var/macports/build/_opt_local_var_macports_sources_rsync.macports.org_release_tarballs_ports_devel_cmake/cmake/work/cmake-3.3.2 /opt/local/var/macports/build/_opt_local_var_macports_sources_rsync.macports.org_release_tarballs_ports_devel_cmake/cmake/work/cmake-3.3.2/Source/kwsys /opt/local/var/macports/build/_opt_local_var_macports_sources_rsync.macports.org_release_tarballs_ports_devel_cmake/cmake/work/cmake-3.3.2/Source/kwsys/CMakeFiles/cmsysTestDynload.dir/DependInfo.cmake --color=
  257. :info:build /Applications/Xcode.app/Contents/Developer/usr/bin/make -f Tests/FindPackageModeMakefileTest/CMakeFiles/foo.dir/build.make Tests/FindPackageModeMakefileTest/CMakeFiles/foo.dir/build
  258. :info:build make[2]: Entering directory `/opt/local/var/macports/build/_opt_local_var_macports_sources_rsync.macports.org_release_tarballs_ports_devel_cmake/cmake/work/cmake-3.3.2'
  259. :info:build make[2]: Nothing to be done for `Tests/RunCMake/CMakeFiles/pseudo_iwyu.dir/build'.
  260. :info:build make[2]: Leaving directory `/opt/local/var/macports/build/_opt_local_var_macports_sources_rsync.macports.org_release_tarballs_ports_devel_cmake/cmake/work/cmake-3.3.2'
  261. :info:build make[2]: Entering directory `/opt/local/var/macports/build/_opt_local_var_macports_sources_rsync.macports.org_release_tarballs_ports_devel_cmake/cmake/work/cmake-3.3.2'
  262. :info:build make[2]: Nothing to be done for `Tests/FindPackageModeMakefileTest/CMakeFiles/foo.dir/build'.
  263. :info:build make[2]: Leaving directory `/opt/local/var/macports/build/_opt_local_var_macports_sources_rsync.macports.org_release_tarballs_ports_devel_cmake/cmake/work/cmake-3.3.2'
  264. :info:build [ 15%] Built target pseudo_emulator
  265. :info:build /Applications/Xcode.app/Contents/Developer/usr/bin/make -f Source/kwsys/CMakeFiles/cmsysTestProcess.dir/build.make Source/kwsys/CMakeFiles/cmsysTestProcess.dir/depend
  266. :info:build make[2]: Leaving directory `/opt/local/var/macports/build/_opt_local_var_macports_sources_rsync.macports.org_release_tarballs_ports_devel_cmake/cmake/work/cmake-3.3.2'
  267. :info:build /Applications/Xcode.app/Contents/Developer/usr/bin/make -f Source/kwsys/CMakeFiles/cmsysTestDynload.dir/build.make Source/kwsys/CMakeFiles/cmsysTestDynload.dir/build
  268. :info:build [ 17%] Built target foo
  269. :info:build [ 17%] Built target pseudo_iwyu
  270. :info:build /Applications/Xcode.app/Contents/Developer/usr/bin/make -f Source/kwsys/CMakeFiles/cmsysTestSharedForward.dir/build.make Source/kwsys/CMakeFiles/cmsysTestSharedForward.dir/depend
  271. :info:build /Applications/Xcode.app/Contents/Developer/usr/bin/make -f Source/kwsys/CMakeFiles/cmsysTestsC.dir/build.make Source/kwsys/CMakeFiles/cmsysTestsC.dir/depend
  272. :info:build make[2]: Entering directory `/opt/local/var/macports/build/_opt_local_var_macports_sources_rsync.macports.org_release_tarballs_ports_devel_cmake/cmake/work/cmake-3.3.2'
  273. :info:build cd /opt/local/var/macports/build/_opt_local_var_macports_sources_rsync.macports.org_release_tarballs_ports_devel_cmake/cmake/work/cmake-3.3.2 && /opt/local/var/macports/build/_opt_local_var_macports_sources_rsync.macports.org_release_tarballs_ports_devel_cmake/cmake/work/cmake-3.3.2/Bootstrap.cmk/cmake -E cmake_depends "Unix Makefiles" /opt/local/var/macports/build/_opt_local_var_macports_sources_rsync.macports.org_release_tarballs_ports_devel_cmake/cmake/work/cmake-3.3.2 /opt/local/var/macports/build/_opt_local_var_macports_sources_rsync.macports.org_release_tarballs_ports_devel_cmake/cmake/work/cmake-3.3.2/Source/kwsys /opt/local/var/macports/build/_opt_local_var_macports_sources_rsync.macports.org_release_tarballs_ports_devel_cmake/cmake/work/cmake-3.3.2 /opt/local/var/macports/build/_opt_local_var_macports_sources_rsync.macports.org_release_tarballs_ports_devel_cmake/cmake/work/cmake-3.3.2/Source/kwsys /opt/local/var/macports/build/_opt_local_var_macports_sources_rsync.macports.org_release_tarballs_ports_devel_cmake/cmake/work/cmake-3.3.2/Source/kwsys/CMakeFiles/cmsysTestProcess.dir/DependInfo.cmake --color=
  274. :info:build make[2]: Entering directory `/opt/local/var/macports/build/_opt_local_var_macports_sources_rsync.macports.org_release_tarballs_ports_devel_cmake/cmake/work/cmake-3.3.2'
  275. :info:build make[2]: Nothing to be done for `Source/kwsys/CMakeFiles/cmsysTestDynload.dir/build'.
  276. :info:build make[2]: Leaving directory `/opt/local/var/macports/build/_opt_local_var_macports_sources_rsync.macports.org_release_tarballs_ports_devel_cmake/cmake/work/cmake-3.3.2'
  277. :info:build make[2]: Entering directory `/opt/local/var/macports/build/_opt_local_var_macports_sources_rsync.macports.org_release_tarballs_ports_devel_cmake/cmake/work/cmake-3.3.2'
  278. :info:build cd /opt/local/var/macports/build/_opt_local_var_macports_sources_rsync.macports.org_release_tarballs_ports_devel_cmake/cmake/work/cmake-3.3.2 && /opt/local/var/macports/build/_opt_local_var_macports_sources_rsync.macports.org_release_tarballs_ports_devel_cmake/cmake/work/cmake-3.3.2/Bootstrap.cmk/cmake -E cmake_depends "Unix Makefiles" /opt/local/var/macports/build/_opt_local_var_macports_sources_rsync.macports.org_release_tarballs_ports_devel_cmake/cmake/work/cmake-3.3.2 /opt/local/var/macports/build/_opt_local_var_macports_sources_rsync.macports.org_release_tarballs_ports_devel_cmake/cmake/work/cmake-3.3.2/Source/kwsys /opt/local/var/macports/build/_opt_local_var_macports_sources_rsync.macports.org_release_tarballs_ports_devel_cmake/cmake/work/cmake-3.3.2 /opt/local/var/macports/build/_opt_local_var_macports_sources_rsync.macports.org_release_tarballs_ports_devel_cmake/cmake/work/cmake-3.3.2/Source/kwsys /opt/local/var/macports/build/_opt_local_var_macports_sources_rsync.macports.org_release_tarballs_ports_devel_cmake/cmake/work/cmake-3.3.2/Source/kwsys/CMakeFiles/cmsysTestSharedForward.dir/DependInfo.cmake --color=
  279. :info:build make[2]: Entering directory `/opt/local/var/macports/build/_opt_local_var_macports_sources_rsync.macports.org_release_tarballs_ports_devel_cmake/cmake/work/cmake-3.3.2'
  280. :info:build cd /opt/local/var/macports/build/_opt_local_var_macports_sources_rsync.macports.org_release_tarballs_ports_devel_cmake/cmake/work/cmake-3.3.2 && /opt/local/var/macports/build/_opt_local_var_macports_sources_rsync.macports.org_release_tarballs_ports_devel_cmake/cmake/work/cmake-3.3.2/Bootstrap.cmk/cmake -E cmake_depends "Unix Makefiles" /opt/local/var/macports/build/_opt_local_var_macports_sources_rsync.macports.org_release_tarballs_ports_devel_cmake/cmake/work/cmake-3.3.2 /opt/local/var/macports/build/_opt_local_var_macports_sources_rsync.macports.org_release_tarballs_ports_devel_cmake/cmake/work/cmake-3.3.2/Source/kwsys /opt/local/var/macports/build/_opt_local_var_macports_sources_rsync.macports.org_release_tarballs_ports_devel_cmake/cmake/work/cmake-3.3.2 /opt/local/var/macports/build/_opt_local_var_macports_sources_rsync.macports.org_release_tarballs_ports_devel_cmake/cmake/work/cmake-3.3.2/Source/kwsys /opt/local/var/macports/build/_opt_local_var_macports_sources_rsync.macports.org_release_tarballs_ports_devel_cmake/cmake/work/cmake-3.3.2/Source/kwsys/CMakeFiles/cmsysTestsC.dir/DependInfo.cmake --color=
  281. :info:build [ 17%] Built target cmsysTestDynload
  282. :info:build /Applications/Xcode.app/Contents/Developer/usr/bin/make -f Source/kwsys/CMakeFiles/cmsysTestsCxx.dir/build.make Source/kwsys/CMakeFiles/cmsysTestsCxx.dir/depend
  283. :info:build make[2]: Leaving directory `/opt/local/var/macports/build/_opt_local_var_macports_sources_rsync.macports.org_release_tarballs_ports_devel_cmake/cmake/work/cmake-3.3.2'
  284. :info:build /Applications/Xcode.app/Contents/Developer/usr/bin/make -f Source/kwsys/CMakeFiles/cmsysTestProcess.dir/build.make Source/kwsys/CMakeFiles/cmsysTestProcess.dir/build
  285. :info:build make[2]: Leaving directory `/opt/local/var/macports/build/_opt_local_var_macports_sources_rsync.macports.org_release_tarballs_ports_devel_cmake/cmake/work/cmake-3.3.2'
  286. :info:build /Applications/Xcode.app/Contents/Developer/usr/bin/make -f Source/kwsys/CMakeFiles/cmsysTestSharedForward.dir/build.make Source/kwsys/CMakeFiles/cmsysTestSharedForward.dir/build
  287. :info:build make[2]: Entering directory `/opt/local/var/macports/build/_opt_local_var_macports_sources_rsync.macports.org_release_tarballs_ports_devel_cmake/cmake/work/cmake-3.3.2'
  288. :info:build cd /opt/local/var/macports/build/_opt_local_var_macports_sources_rsync.macports.org_release_tarballs_ports_devel_cmake/cmake/work/cmake-3.3.2 && /opt/local/var/macports/build/_opt_local_var_macports_sources_rsync.macports.org_release_tarballs_ports_devel_cmake/cmake/work/cmake-3.3.2/Bootstrap.cmk/cmake -E cmake_depends "Unix Makefiles" /opt/local/var/macports/build/_opt_local_var_macports_sources_rsync.macports.org_release_tarballs_ports_devel_cmake/cmake/work/cmake-3.3.2 /opt/local/var/macports/build/_opt_local_var_macports_sources_rsync.macports.org_release_tarballs_ports_devel_cmake/cmake/work/cmake-3.3.2/Source/kwsys /opt/local/var/macports/build/_opt_local_var_macports_sources_rsync.macports.org_release_tarballs_ports_devel_cmake/cmake/work/cmake-3.3.2 /opt/local/var/macports/build/_opt_local_var_macports_sources_rsync.macports.org_release_tarballs_ports_devel_cmake/cmake/work/cmake-3.3.2/Source/kwsys /opt/local/var/macports/build/_opt_local_var_macports_sources_rsync.macports.org_release_tarballs_ports_devel_cmake/cmake/work/cmake-3.3.2/Source/kwsys/CMakeFiles/cmsysTestsCxx.dir/DependInfo.cmake --color=
  289. :info:build make[2]: Leaving directory `/opt/local/var/macports/build/_opt_local_var_macports_sources_rsync.macports.org_release_tarballs_ports_devel_cmake/cmake/work/cmake-3.3.2'
  290. :info:build /Applications/Xcode.app/Contents/Developer/usr/bin/make -f Source/kwsys/CMakeFiles/cmsysTestsC.dir/build.make Source/kwsys/CMakeFiles/cmsysTestsC.dir/build
  291. :info:build make[2]: Entering directory `/opt/local/var/macports/build/_opt_local_var_macports_sources_rsync.macports.org_release_tarballs_ports_devel_cmake/cmake/work/cmake-3.3.2'
  292. :info:build make[2]: Nothing to be done for `Source/kwsys/CMakeFiles/cmsysTestProcess.dir/build'.
  293. :info:build make[2]: Leaving directory `/opt/local/var/macports/build/_opt_local_var_macports_sources_rsync.macports.org_release_tarballs_ports_devel_cmake/cmake/work/cmake-3.3.2'
  294. :info:build make[2]: Entering directory `/opt/local/var/macports/build/_opt_local_var_macports_sources_rsync.macports.org_release_tarballs_ports_devel_cmake/cmake/work/cmake-3.3.2'
  295. :info:build make[2]: Nothing to be done for `Source/kwsys/CMakeFiles/cmsysTestSharedForward.dir/build'.
  296. :info:build make[2]: Leaving directory `/opt/local/var/macports/build/_opt_local_var_macports_sources_rsync.macports.org_release_tarballs_ports_devel_cmake/cmake/work/cmake-3.3.2'
  297. :info:build make[2]: Entering directory `/opt/local/var/macports/build/_opt_local_var_macports_sources_rsync.macports.org_release_tarballs_ports_devel_cmake/cmake/work/cmake-3.3.2'
  298. :info:build make[2]: Nothing to be done for `Source/kwsys/CMakeFiles/cmsysTestsC.dir/build'.
  299. :info:build make[2]: Leaving directory `/opt/local/var/macports/build/_opt_local_var_macports_sources_rsync.macports.org_release_tarballs_ports_devel_cmake/cmake/work/cmake-3.3.2'
  300. :info:build [ 18%] Built target cmsysTestSharedForward
  301. :info:build [ 18%] Built target cmsysTestProcess
  302. :info:build /Applications/Xcode.app/Contents/Developer/usr/bin/make -f Source/CMakeFiles/CMakeLib.dir/build.make Source/CMakeFiles/CMakeLib.dir/depend
  303. :info:build /Applications/Xcode.app/Contents/Developer/usr/bin/make -f Source/CMakeFiles/OSXScriptLauncher.dir/build.make Source/CMakeFiles/OSXScriptLauncher.dir/depend
  304. :info:build [ 20%] Built target cmsysTestsC
  305. :info:build make[2]: Entering directory `/opt/local/var/macports/build/_opt_local_var_macports_sources_rsync.macports.org_release_tarballs_ports_devel_cmake/cmake/work/cmake-3.3.2'
  306. :info:build cd /opt/local/var/macports/build/_opt_local_var_macports_sources_rsync.macports.org_release_tarballs_ports_devel_cmake/cmake/work/cmake-3.3.2 && /opt/local/var/macports/build/_opt_local_var_macports_sources_rsync.macports.org_release_tarballs_ports_devel_cmake/cmake/work/cmake-3.3.2/Bootstrap.cmk/cmake -E cmake_depends "Unix Makefiles" /opt/local/var/macports/build/_opt_local_var_macports_sources_rsync.macports.org_release_tarballs_ports_devel_cmake/cmake/work/cmake-3.3.2 /opt/local/var/macports/build/_opt_local_var_macports_sources_rsync.macports.org_release_tarballs_ports_devel_cmake/cmake/work/cmake-3.3.2/Source /opt/local/var/macports/build/_opt_local_var_macports_sources_rsync.macports.org_release_tarballs_ports_devel_cmake/cmake/work/cmake-3.3.2 /opt/local/var/macports/build/_opt_local_var_macports_sources_rsync.macports.org_release_tarballs_ports_devel_cmake/cmake/work/cmake-3.3.2/Source /opt/local/var/macports/build/_opt_local_var_macports_sources_rsync.macports.org_release_tarballs_ports_devel_cmake/cmake/work/cmake-3.3.2/Source/CMakeFiles/OSXScriptLauncher.dir/DependInfo.cmake --color=
  307. :info:build make[2]: Leaving directory `/opt/local/var/macports/build/_opt_local_var_macports_sources_rsync.macports.org_release_tarballs_ports_devel_cmake/cmake/work/cmake-3.3.2'
  308. :info:build /Applications/Xcode.app/Contents/Developer/usr/bin/make -f Source/kwsys/CMakeFiles/cmsysTestsCxx.dir/build.make Source/kwsys/CMakeFiles/cmsysTestsCxx.dir/build
  309. :info:build make[2]: Entering directory `/opt/local/var/macports/build/_opt_local_var_macports_sources_rsync.macports.org_release_tarballs_ports_devel_cmake/cmake/work/cmake-3.3.2'
  310. :info:build make[2]: Nothing to be done for `Source/kwsys/CMakeFiles/cmsysTestsCxx.dir/build'.
  311. :info:build make[2]: Leaving directory `/opt/local/var/macports/build/_opt_local_var_macports_sources_rsync.macports.org_release_tarballs_ports_devel_cmake/cmake/work/cmake-3.3.2'
  312. :info:build make[2]: Leaving directory `/opt/local/var/macports/build/_opt_local_var_macports_sources_rsync.macports.org_release_tarballs_ports_devel_cmake/cmake/work/cmake-3.3.2'
  313. :info:build /Applications/Xcode.app/Contents/Developer/usr/bin/make -f Source/CMakeFiles/OSXScriptLauncher.dir/build.make Source/CMakeFiles/OSXScriptLauncher.dir/build
  314. :info:build make[2]: Entering directory `/opt/local/var/macports/build/_opt_local_var_macports_sources_rsync.macports.org_release_tarballs_ports_devel_cmake/cmake/work/cmake-3.3.2'
  315. :info:build make[2]: Nothing to be done for `Source/CMakeFiles/OSXScriptLauncher.dir/build'.
  316. :info:build make[2]: Leaving directory `/opt/local/var/macports/build/_opt_local_var_macports_sources_rsync.macports.org_release_tarballs_ports_devel_cmake/cmake/work/cmake-3.3.2'
  317. :info:build [ 24%] Built target cmsysTestsCxx
  318. :info:build [ 24%] Built target OSXScriptLauncher
  319. :info:build make[2]: Entering directory `/opt/local/var/macports/build/_opt_local_var_macports_sources_rsync.macports.org_release_tarballs_ports_devel_cmake/cmake/work/cmake-3.3.2'
  320. :info:build cd /opt/local/var/macports/build/_opt_local_var_macports_sources_rsync.macports.org_release_tarballs_ports_devel_cmake/cmake/work/cmake-3.3.2 && /opt/local/var/macports/build/_opt_local_var_macports_sources_rsync.macports.org_release_tarballs_ports_devel_cmake/cmake/work/cmake-3.3.2/Bootstrap.cmk/cmake -E cmake_depends "Unix Makefiles" /opt/local/var/macports/build/_opt_local_var_macports_sources_rsync.macports.org_release_tarballs_ports_devel_cmake/cmake/work/cmake-3.3.2 /opt/local/var/macports/build/_opt_local_var_macports_sources_rsync.macports.org_release_tarballs_ports_devel_cmake/cmake/work/cmake-3.3.2/Source /opt/local/var/macports/build/_opt_local_var_macports_sources_rsync.macports.org_release_tarballs_ports_devel_cmake/cmake/work/cmake-3.3.2 /opt/local/var/macports/build/_opt_local_var_macports_sources_rsync.macports.org_release_tarballs_ports_devel_cmake/cmake/work/cmake-3.3.2/Source /opt/local/var/macports/build/_opt_local_var_macports_sources_rsync.macports.org_release_tarballs_ports_devel_cmake/cmake/work/cmake-3.3.2/Source/CMakeFiles/CMakeLib.dir/DependInfo.cmake --color=
  321. :info:build make[2]: Leaving directory `/opt/local/var/macports/build/_opt_local_var_macports_sources_rsync.macports.org_release_tarballs_ports_devel_cmake/cmake/work/cmake-3.3.2'
  322. :info:build /Applications/Xcode.app/Contents/Developer/usr/bin/make -f Source/CMakeFiles/CMakeLib.dir/build.make Source/CMakeFiles/CMakeLib.dir/build
  323. :info:build make[2]: Entering directory `/opt/local/var/macports/build/_opt_local_var_macports_sources_rsync.macports.org_release_tarballs_ports_devel_cmake/cmake/work/cmake-3.3.2'
  324. :info:build make[2]: Nothing to be done for `Source/CMakeFiles/CMakeLib.dir/build'.
  325. :info:build make[2]: Leaving directory `/opt/local/var/macports/build/_opt_local_var_macports_sources_rsync.macports.org_release_tarballs_ports_devel_cmake/cmake/work/cmake-3.3.2'
  326. :info:build [ 63%] Built target CMakeLib
  327. :info:build /Applications/Xcode.app/Contents/Developer/usr/bin/make -f Source/CMakeFiles/CPackLib.dir/build.make Source/CMakeFiles/CPackLib.dir/depend
  328. :info:build /Applications/Xcode.app/Contents/Developer/usr/bin/make -f Source/CMakeFiles/CTestLib.dir/build.make Source/CMakeFiles/CTestLib.dir/depend
  329. :info:build /Applications/Xcode.app/Contents/Developer/usr/bin/make -f Source/CMakeFiles/ccmake.dir/build.make Source/CMakeFiles/ccmake.dir/depend
  330. :info:build /Applications/Xcode.app/Contents/Developer/usr/bin/make -f Source/CMakeFiles/cmake.dir/build.make Source/CMakeFiles/cmake.dir/depend
  331. :info:build make[2]: Entering directory `/opt/local/var/macports/build/_opt_local_var_macports_sources_rsync.macports.org_release_tarballs_ports_devel_cmake/cmake/work/cmake-3.3.2'
  332. :info:build cd /opt/local/var/macports/build/_opt_local_var_macports_sources_rsync.macports.org_release_tarballs_ports_devel_cmake/cmake/work/cmake-3.3.2 && /opt/local/var/macports/build/_opt_local_var_macports_sources_rsync.macports.org_release_tarballs_ports_devel_cmake/cmake/work/cmake-3.3.2/Bootstrap.cmk/cmake -E cmake_depends "Unix Makefiles" /opt/local/var/macports/build/_opt_local_var_macports_sources_rsync.macports.org_release_tarballs_ports_devel_cmake/cmake/work/cmake-3.3.2 /opt/local/var/macports/build/_opt_local_var_macports_sources_rsync.macports.org_release_tarballs_ports_devel_cmake/cmake/work/cmake-3.3.2/Source /opt/local/var/macports/build/_opt_local_var_macports_sources_rsync.macports.org_release_tarballs_ports_devel_cmake/cmake/work/cmake-3.3.2 /opt/local/var/macports/build/_opt_local_var_macports_sources_rsync.macports.org_release_tarballs_ports_devel_cmake/cmake/work/cmake-3.3.2/Source /opt/local/var/macports/build/_opt_local_var_macports_sources_rsync.macports.org_release_tarballs_ports_devel_cmake/cmake/work/cmake-3.3.2/Source/CMakeFiles/cmake.dir/DependInfo.cmake --color=
  333. :info:build make[2]: Entering directory `/opt/local/var/macports/build/_opt_local_var_macports_sources_rsync.macports.org_release_tarballs_ports_devel_cmake/cmake/work/cmake-3.3.2'
  334. :info:build cd /opt/local/var/macports/build/_opt_local_var_macports_sources_rsync.macports.org_release_tarballs_ports_devel_cmake/cmake/work/cmake-3.3.2 && /opt/local/var/macports/build/_opt_local_var_macports_sources_rsync.macports.org_release_tarballs_ports_devel_cmake/cmake/work/cmake-3.3.2/Bootstrap.cmk/cmake -E cmake_depends "Unix Makefiles" /opt/local/var/macports/build/_opt_local_var_macports_sources_rsync.macports.org_release_tarballs_ports_devel_cmake/cmake/work/cmake-3.3.2 /opt/local/var/macports/build/_opt_local_var_macports_sources_rsync.macports.org_release_tarballs_ports_devel_cmake/cmake/work/cmake-3.3.2/Source /opt/local/var/macports/build/_opt_local_var_macports_sources_rsync.macports.org_release_tarballs_ports_devel_cmake/cmake/work/cmake-3.3.2 /opt/local/var/macports/build/_opt_local_var_macports_sources_rsync.macports.org_release_tarballs_ports_devel_cmake/cmake/work/cmake-3.3.2/Source /opt/local/var/macports/build/_opt_local_var_macports_sources_rsync.macports.org_release_tarballs_ports_devel_cmake/cmake/work/cmake-3.3.2/Source/CMakeFiles/ccmake.dir/DependInfo.cmake --color=
  335. :info:build make[2]: Entering directory `/opt/local/var/macports/build/_opt_local_var_macports_sources_rsync.macports.org_release_tarballs_ports_devel_cmake/cmake/work/cmake-3.3.2'
  336. :info:build cd /opt/local/var/macports/build/_opt_local_var_macports_sources_rsync.macports.org_release_tarballs_ports_devel_cmake/cmake/work/cmake-3.3.2 && /opt/local/var/macports/build/_opt_local_var_macports_sources_rsync.macports.org_release_tarballs_ports_devel_cmake/cmake/work/cmake-3.3.2/Bootstrap.cmk/cmake -E cmake_depends "Unix Makefiles" /opt/local/var/macports/build/_opt_local_var_macports_sources_rsync.macports.org_release_tarballs_ports_devel_cmake/cmake/work/cmake-3.3.2 /opt/local/var/macports/build/_opt_local_var_macports_sources_rsync.macports.org_release_tarballs_ports_devel_cmake/cmake/work/cmake-3.3.2/Source /opt/local/var/macports/build/_opt_local_var_macports_sources_rsync.macports.org_release_tarballs_ports_devel_cmake/cmake/work/cmake-3.3.2 /opt/local/var/macports/build/_opt_local_var_macports_sources_rsync.macports.org_release_tarballs_ports_devel_cmake/cmake/work/cmake-3.3.2/Source /opt/local/var/macports/build/_opt_local_var_macports_sources_rsync.macports.org_release_tarballs_ports_devel_cmake/cmake/work/cmake-3.3.2/Source/CMakeFiles/CPackLib.dir/DependInfo.cmake --color=
  337. :info:build make[2]: Entering directory `/opt/local/var/macports/build/_opt_local_var_macports_sources_rsync.macports.org_release_tarballs_ports_devel_cmake/cmake/work/cmake-3.3.2'
  338. :info:build cd /opt/local/var/macports/build/_opt_local_var_macports_sources_rsync.macports.org_release_tarballs_ports_devel_cmake/cmake/work/cmake-3.3.2 && /opt/local/var/macports/build/_opt_local_var_macports_sources_rsync.macports.org_release_tarballs_ports_devel_cmake/cmake/work/cmake-3.3.2/Bootstrap.cmk/cmake -E cmake_depends "Unix Makefiles" /opt/local/var/macports/build/_opt_local_var_macports_sources_rsync.macports.org_release_tarballs_ports_devel_cmake/cmake/work/cmake-3.3.2 /opt/local/var/macports/build/_opt_local_var_macports_sources_rsync.macports.org_release_tarballs_ports_devel_cmake/cmake/work/cmake-3.3.2/Source /opt/local/var/macports/build/_opt_local_var_macports_sources_rsync.macports.org_release_tarballs_ports_devel_cmake/cmake/work/cmake-3.3.2 /opt/local/var/macports/build/_opt_local_var_macports_sources_rsync.macports.org_release_tarballs_ports_devel_cmake/cmake/work/cmake-3.3.2/Source /opt/local/var/macports/build/_opt_local_var_macports_sources_rsync.macports.org_release_tarballs_ports_devel_cmake/cmake/work/cmake-3.3.2/Source/CMakeFiles/CTestLib.dir/DependInfo.cmake --color=
  339. :info:build make[2]: Leaving directory `/opt/local/var/macports/build/_opt_local_var_macports_sources_rsync.macports.org_release_tarballs_ports_devel_cmake/cmake/work/cmake-3.3.2'
  340. :info:build /Applications/Xcode.app/Contents/Developer/usr/bin/make -f Source/CMakeFiles/cmake.dir/build.make Source/CMakeFiles/cmake.dir/build
  341. :info:build make[2]: Entering directory `/opt/local/var/macports/build/_opt_local_var_macports_sources_rsync.macports.org_release_tarballs_ports_devel_cmake/cmake/work/cmake-3.3.2'
  342. :info:build [ 63%] Linking CXX executable ../bin/cmake
  343. :info:build cd /opt/local/var/macports/build/_opt_local_var_macports_sources_rsync.macports.org_release_tarballs_ports_devel_cmake/cmake/work/cmake-3.3.2/Source && /opt/local/var/macports/build/_opt_local_var_macports_sources_rsync.macports.org_release_tarballs_ports_devel_cmake/cmake/work/cmake-3.3.2/Bootstrap.cmk/cmake -E cmake_link_script CMakeFiles/cmake.dir/link.txt --verbose=ON
  344. :info:build make[2]: Leaving directory `/opt/local/var/macports/build/_opt_local_var_macports_sources_rsync.macports.org_release_tarballs_ports_devel_cmake/cmake/work/cmake-3.3.2'
  345. :info:build /Applications/Xcode.app/Contents/Developer/usr/bin/make -f Source/CMakeFiles/ccmake.dir/build.make Source/CMakeFiles/ccmake.dir/build
  346. :info:build /Applications/Xcode.app/Contents/Developer/Toolchains/XcodeDefault.xctoolchain/usr/bin/clang++   -pipe -Os -arch x86_64 -stdlib=libc++  -isysroot /Applications/Xcode.app/Contents/Developer/Platforms/MacOSX.platform/Developer/SDKs/MacOSX10.11.sdk -mmacosx-version-min=10.11 -Wl,-search_paths_first -Wl,-headerpad_max_install_names  -L/opt/local/lib -Wl,-headerpad_max_install_names -arch x86_64 CMakeFiles/cmake.dir/cmakemain.cxx.o CMakeFiles/cmake.dir/cmcmd.cxx.o  -o ../bin/cmake -F/Library/Frameworks  libCMakeLib.a kwsys/libcmsys.a /opt/local/lib/libexpat.dylib /opt/local/lib/libz.dylib /opt/local/lib/libarchive.dylib ../Utilities/cmcompress/libcmcompress.a -framework libcurl ../Utilities/cmjsoncpp/libcmjsoncpp.a -framework CoreFoundation
  347. :info:build make[2]: Entering directory `/opt/local/var/macports/build/_opt_local_var_macports_sources_rsync.macports.org_release_tarballs_ports_devel_cmake/cmake/work/cmake-3.3.2'
  348. :info:build [ 64%] Linking CXX executable ../bin/ccmake
  349. :info:build cd /opt/local/var/macports/build/_opt_local_var_macports_sources_rsync.macports.org_release_tarballs_ports_devel_cmake/cmake/work/cmake-3.3.2/Source && /opt/local/var/macports/build/_opt_local_var_macports_sources_rsync.macports.org_release_tarballs_ports_devel_cmake/cmake/work/cmake-3.3.2/Bootstrap.cmk/cmake -E cmake_link_script CMakeFiles/ccmake.dir/link.txt --verbose=ON
  350. :info:build ld: warning: ignoring file /Library/Frameworks/libcurl.framework/libcurl, missing required architecture x86_64 in file /Library/Frameworks/libcurl.framework/libcurl (2 slices)
  351. :info:build make[2]: Leaving directory `/opt/local/var/macports/build/_opt_local_var_macports_sources_rsync.macports.org_release_tarballs_ports_devel_cmake/cmake/work/cmake-3.3.2'
  352. :info:build /Applications/Xcode.app/Contents/Developer/usr/bin/make -f Source/CMakeFiles/CPackLib.dir/build.make Source/CMakeFiles/CPackLib.dir/build
  353. :info:build /Applications/Xcode.app/Contents/Developer/Toolchains/XcodeDefault.xctoolchain/usr/bin/clang++   -pipe -Os -arch x86_64 -stdlib=libc++  -isysroot /Applications/Xcode.app/Contents/Developer/Platforms/MacOSX.platform/Developer/SDKs/MacOSX10.11.sdk -mmacosx-version-min=10.11 -Wl,-search_paths_first -Wl,-headerpad_max_install_names  -L/opt/local/lib -Wl,-headerpad_max_install_names -arch x86_64 CMakeFiles/ccmake.dir/CursesDialog/cmCursesOptionsWidget.cxx.o CMakeFiles/ccmake.dir/CursesDialog/cmCursesBoolWidget.cxx.o CMakeFiles/ccmake.dir/CursesDialog/cmCursesCacheEntryComposite.cxx.o CMakeFiles/ccmake.dir/CursesDialog/cmCursesDummyWidget.cxx.o CMakeFiles/ccmake.dir/CursesDialog/cmCursesFilePathWidget.cxx.o CMakeFiles/ccmake.dir/CursesDialog/cmCursesForm.cxx.o CMakeFiles/ccmake.dir/CursesDialog/cmCursesLabelWidget.cxx.o CMakeFiles/ccmake.dir/CursesDialog/cmCursesLongMessageForm.cxx.o CMakeFiles/ccmake.dir/CursesDialog/cmCursesMainForm.cxx.o CMakeFiles/ccmake.dir/CursesDialog/cmCursesPathWidget.cxx.o CMakeFiles/ccmake.dir/CursesDialog/cmCursesStringWidget.cxx.o CMakeFiles/ccmake.dir/CursesDialog/cmCursesWidget.cxx.o CMakeFiles/ccmake.dir/CursesDialog/ccmake.cxx.o  -o ../bin/ccmake -F/Library/Frameworks  libCMakeLib.a /opt/local/lib/libform.dylib /opt/local/lib/libncurses.dylib kwsys/libcmsys.a /opt/local/lib/libexpat.dylib /opt/local/lib/libz.dylib /opt/local/lib/libarchive.dylib ../Utilities/cmcompress/libcmcompress.a -framework libcurl ../Utilities/cmjsoncpp/libcmjsoncpp.a -framework CoreFoundation
  354. :info:build make[2]: Entering directory `/opt/local/var/macports/build/_opt_local_var_macports_sources_rsync.macports.org_release_tarballs_ports_devel_cmake/cmake/work/cmake-3.3.2'
  355. :info:build make[2]: Nothing to be done for `Source/CMakeFiles/CPackLib.dir/build'.
  356. :info:build make[2]: Leaving directory `/opt/local/var/macports/build/_opt_local_var_macports_sources_rsync.macports.org_release_tarballs_ports_devel_cmake/cmake/work/cmake-3.3.2'
  357. :info:build ld: warning: ignoring file /Library/Frameworks/libcurl.framework/libcurl, missing required architecture x86_64 in file /Library/Frameworks/libcurl.framework/libcurl (2 slices)
  358. :info:build [ 72%] Built target CPackLib
  359. :info:build /Applications/Xcode.app/Contents/Developer/usr/bin/make -f Source/CMakeFiles/cmakexbuild.dir/build.make Source/CMakeFiles/cmakexbuild.dir/depend
  360. :info:build make[2]: Entering directory `/opt/local/var/macports/build/_opt_local_var_macports_sources_rsync.macports.org_release_tarballs_ports_devel_cmake/cmake/work/cmake-3.3.2'
  361. :info:build cd /opt/local/var/macports/build/_opt_local_var_macports_sources_rsync.macports.org_release_tarballs_ports_devel_cmake/cmake/work/cmake-3.3.2 && /opt/local/var/macports/build/_opt_local_var_macports_sources_rsync.macports.org_release_tarballs_ports_devel_cmake/cmake/work/cmake-3.3.2/Bootstrap.cmk/cmake -E cmake_depends "Unix Makefiles" /opt/local/var/macports/build/_opt_local_var_macports_sources_rsync.macports.org_release_tarballs_ports_devel_cmake/cmake/work/cmake-3.3.2 /opt/local/var/macports/build/_opt_local_var_macports_sources_rsync.macports.org_release_tarballs_ports_devel_cmake/cmake/work/cmake-3.3.2/Source /opt/local/var/macports/build/_opt_local_var_macports_sources_rsync.macports.org_release_tarballs_ports_devel_cmake/cmake/work/cmake-3.3.2 /opt/local/var/macports/build/_opt_local_var_macports_sources_rsync.macports.org_release_tarballs_ports_devel_cmake/cmake/work/cmake-3.3.2/Source /opt/local/var/macports/build/_opt_local_var_macports_sources_rsync.macports.org_release_tarballs_ports_devel_cmake/cmake/work/cmake-3.3.2/Source/CMakeFiles/cmakexbuild.dir/DependInfo.cmake --color=
  362. :info:build make[2]: Leaving directory `/opt/local/var/macports/build/_opt_local_var_macports_sources_rsync.macports.org_release_tarballs_ports_devel_cmake/cmake/work/cmake-3.3.2'
  363. :info:build /Applications/Xcode.app/Contents/Developer/usr/bin/make -f Source/CMakeFiles/cmakexbuild.dir/build.make Source/CMakeFiles/cmakexbuild.dir/build
  364. :info:build make[2]: Entering directory `/opt/local/var/macports/build/_opt_local_var_macports_sources_rsync.macports.org_release_tarballs_ports_devel_cmake/cmake/work/cmake-3.3.2'
  365. :info:build make[2]: Nothing to be done for `Source/CMakeFiles/cmakexbuild.dir/build'.
  366. :info:build make[2]: Leaving directory `/opt/local/var/macports/build/_opt_local_var_macports_sources_rsync.macports.org_release_tarballs_ports_devel_cmake/cmake/work/cmake-3.3.2'
  367. :info:build [ 73%] Built target cmakexbuild
  368. :info:build /Applications/Xcode.app/Contents/Developer/usr/bin/make -f Source/CMakeFiles/cpack.dir/build.make Source/CMakeFiles/cpack.dir/depend
  369. :info:build make[2]: Entering directory `/opt/local/var/macports/build/_opt_local_var_macports_sources_rsync.macports.org_release_tarballs_ports_devel_cmake/cmake/work/cmake-3.3.2'
  370. :info:build cd /opt/local/var/macports/build/_opt_local_var_macports_sources_rsync.macports.org_release_tarballs_ports_devel_cmake/cmake/work/cmake-3.3.2 && /opt/local/var/macports/build/_opt_local_var_macports_sources_rsync.macports.org_release_tarballs_ports_devel_cmake/cmake/work/cmake-3.3.2/Bootstrap.cmk/cmake -E cmake_depends "Unix Makefiles" /opt/local/var/macports/build/_opt_local_var_macports_sources_rsync.macports.org_release_tarballs_ports_devel_cmake/cmake/work/cmake-3.3.2 /opt/local/var/macports/build/_opt_local_var_macports_sources_rsync.macports.org_release_tarballs_ports_devel_cmake/cmake/work/cmake-3.3.2/Source /opt/local/var/macports/build/_opt_local_var_macports_sources_rsync.macports.org_release_tarballs_ports_devel_cmake/cmake/work/cmake-3.3.2 /opt/local/var/macports/build/_opt_local_var_macports_sources_rsync.macports.org_release_tarballs_ports_devel_cmake/cmake/work/cmake-3.3.2/Source /opt/local/var/macports/build/_opt_local_var_macports_sources_rsync.macports.org_release_tarballs_ports_devel_cmake/cmake/work/cmake-3.3.2/Source/CMakeFiles/cpack.dir/DependInfo.cmake --color=
  371. :info:build make[2]: Leaving directory `/opt/local/var/macports/build/_opt_local_var_macports_sources_rsync.macports.org_release_tarballs_ports_devel_cmake/cmake/work/cmake-3.3.2'
  372. :info:build /Applications/Xcode.app/Contents/Developer/usr/bin/make -f Source/CMakeFiles/CTestLib.dir/build.make Source/CMakeFiles/CTestLib.dir/build
  373. :info:build make[2]: Leaving directory `/opt/local/var/macports/build/_opt_local_var_macports_sources_rsync.macports.org_release_tarballs_ports_devel_cmake/cmake/work/cmake-3.3.2'
  374. :info:build /Applications/Xcode.app/Contents/Developer/usr/bin/make -f Source/CMakeFiles/cpack.dir/build.make Source/CMakeFiles/cpack.dir/build
  375. :info:build make[2]: Entering directory `/opt/local/var/macports/build/_opt_local_var_macports_sources_rsync.macports.org_release_tarballs_ports_devel_cmake/cmake/work/cmake-3.3.2'
  376. :info:build [ 74%] Linking CXX executable ../bin/cpack
  377. :info:build cd /opt/local/var/macports/build/_opt_local_var_macports_sources_rsync.macports.org_release_tarballs_ports_devel_cmake/cmake/work/cmake-3.3.2/Source && /opt/local/var/macports/build/_opt_local_var_macports_sources_rsync.macports.org_release_tarballs_ports_devel_cmake/cmake/work/cmake-3.3.2/Bootstrap.cmk/cmake -E cmake_link_script CMakeFiles/cpack.dir/link.txt --verbose=ON
  378. :info:build make[2]: Entering directory `/opt/local/var/macports/build/_opt_local_var_macports_sources_rsync.macports.org_release_tarballs_ports_devel_cmake/cmake/work/cmake-3.3.2'
  379. :info:build make[2]: Nothing to be done for `Source/CMakeFiles/CTestLib.dir/build'.
  380. :info:build make[2]: Leaving directory `/opt/local/var/macports/build/_opt_local_var_macports_sources_rsync.macports.org_release_tarballs_ports_devel_cmake/cmake/work/cmake-3.3.2'
  381. :info:build Undefined symbols for architecture x86_64:
  382. :info:build   "_curl_easy_cleanup", referenced from:
  383. :info:build       cmFileCommand::HandleDownloadCommand(std::__1::vector<std::__1::basic_string<char, std::__1::char_traits<char>, std::__1::allocator<char> >, std::__1::allocator<std::__1::basic_string<char, std::__1::char_traits<char>, std::__1::allocator<char> > > > const&) in libCMakeLib.a(cmBootstrapCommands1.cxx.o)
  384. :info:build       cmFileCommand::HandleUploadCommand(std::__1::vector<std::__1::basic_string<char, std::__1::char_traits<char>, std::__1::allocator<char> >, std::__1::allocator<std::__1::basic_string<char, std::__1::char_traits<char>, std::__1::allocator<char> > > > const&) in libCMakeLib.a(cmBootstrapCommands1.cxx.o)
  385. :info:build       (anonymous namespace)::cURLEasyGuard::~cURLEasyGuard() in libCMakeLib.a(cmBootstrapCommands1.cxx.o)
  386. :info:build Undefined symbols for architecture x86_64:
  387. :info:build   "_curl_easy_cleanup", referenced from:
  388. :info:build       cmFileCommand::HandleDownloadCommand(std::__1::vector<std::__1::basic_string<char, std::__1::char_traits<char>, std::__1::allocator<char> >, std::__1::allocator<std::__1::basic_string<char, std::__1::char_traits<char>, std::__1::allocator<char> > > > const&) in libCMakeLib.a(cmBootstrapCommands1.cxx.o)
  389. :info:build       cmFileCommand::HandleUploadCommand(std::__1::vector<std::__1::basic_string<char, std::__1::char_traits<char>, std::__1::allocator<char> >, std::__1::allocator<std::__1::basic_string<char, std::__1::char_traits<char>, std::__1::allocator<char> > > > const&) in libCMakeLib.a(cmBootstrapCommands1.cxx.o)
  390. :info:build       (anonymous namespace)::cURLEasyGuard::~cURLEasyGuard() in libCMakeLib.a(cmBootstrapCommands1.cxx.o)
  391. :info:build   "_curl_easy_init", referenced from:
  392. :info:build       cmFileCommand::HandleDownloadCommand(std::__1::vector<std::__1::basic_string<char, std::__1::char_traits<char>, std::__1::allocator<char> >, std::__1::allocator<std::__1::basic_string<char, std::__1::char_traits<char>, std::__1::allocator<char> > > > const&) in libCMakeLib.a(cmBootstrapCommands1.cxx.o)
  393. :info:build       cmFileCommand::HandleUploadCommand(std::__1::vector<std::__1::basic_string<char, std::__1::char_traits<char>, std::__1::allocator<char> >, std::__1::allocator<std::__1::basic_string<char, std::__1::char_traits<char>, std::__1::allocator<char> > > > const&) in libCMakeLib.a(cmBootstrapCommands1.cxx.o)
  394. :info:build /Applications/Xcode.app/Contents/Developer/Toolchains/XcodeDefault.xctoolchain/usr/bin/clang++   -pipe -Os -arch x86_64 -stdlib=libc++  -isysroot /Applications/Xcode.app/Contents/Developer/Platforms/MacOSX.platform/Developer/SDKs/MacOSX10.11.sdk -mmacosx-version-min=10.11 -Wl,-search_paths_first -Wl,-headerpad_max_install_names  -L/opt/local/lib -Wl,-headerpad_max_install_names -arch x86_64 CMakeFiles/cpack.dir/CPack/cpack.cxx.o  -o ../bin/cpack -F/Library/Frameworks  libCPackLib.a libCMakeLib.a kwsys/libcmsys.a /opt/local/lib/libexpat.dylib /opt/local/lib/libz.dylib /opt/local/lib/libarchive.dylib ../Utilities/cmcompress/libcmcompress.a -framework libcurl ../Utilities/cmjsoncpp/libcmjsoncpp.a -framework CoreFoundation
  395. :info:build   "_curl_easy_init", referenced from:
  396. :info:build       cmFileCommand::HandleDownloadCommand(std::__1::vector<std::__1::basic_string<char, std::__1::char_traits<char>, std::__1::allocator<char> >, std::__1::allocator<std::__1::basic_string<char, std::__1::char_traits<char>, std::__1::allocator<char> > > > const&) in libCMakeLib.a(cmBootstrapCommands1.cxx.o)
  397. :info:build       cmFileCommand::HandleUploadCommand(std::__1::vector<std::__1::basic_string<char, std::__1::char_traits<char>, std::__1::allocator<char> >, std::__1::allocator<std::__1::basic_string<char, std::__1::char_traits<char>, std::__1::allocator<char> > > > const&) in libCMakeLib.a(cmBootstrapCommands1.cxx.o)
  398. :info:build   "_curl_easy_perform", referenced from:
  399. :info:build       cmFileCommand::HandleDownloadCommand(std::__1::vector<std::__1::basic_string<char, std::__1::char_traits<char>, std::__1::allocator<char> >, std::__1::allocator<std::__1::basic_string<char, std::__1::char_traits<char>, std::__1::allocator<char> > > > const&) in libCMakeLib.a(cmBootstrapCommands1.cxx.o)
  400. :info:build       cmFileCommand::HandleUploadCommand(std::__1::vector<std::__1::basic_string<char, std::__1::char_traits<char>, std::__1::allocator<char> >, std::__1::allocator<std::__1::basic_string<char, std::__1::char_traits<char>, std::__1::allocator<char> > > > const&) in libCMakeLib.a(cmBootstrapCommands1.cxx.o)
  401. :info:build [ 90%] Built target CTestLib
  402. :info:build /Applications/Xcode.app/Contents/Developer/usr/bin/make -f Tests/CMakeLib/CMakeFiles/CMakeLibTests.dir/build.make Tests/CMakeLib/CMakeFiles/CMakeLibTests.dir/depend
  403. :info:build   "_curl_easy_perform", referenced from:
  404. :info:build       cmFileCommand::HandleDownloadCommand(std::__1::vector<std::__1::basic_string<char, std::__1::char_traits<char>, std::__1::allocator<char> >, std::__1::allocator<std::__1::basic_string<char, std::__1::char_traits<char>, std::__1::allocator<char> > > > const&) in libCMakeLib.a(cmBootstrapCommands1.cxx.o)
  405. :info:build       cmFileCommand::HandleUploadCommand(std::__1::vector<std::__1::basic_string<char, std::__1::char_traits<char>, std::__1::allocator<char> >, std::__1::allocator<std::__1::basic_string<char, std::__1::char_traits<char>, std::__1::allocator<char> > > > const&) in libCMakeLib.a(cmBootstrapCommands1.cxx.o)
  406. :info:build   "_curl_easy_setopt", referenced from:
  407. :info:build       cmFileCommand::HandleDownloadCommand(std::__1::vector<std::__1::basic_string<char, std::__1::char_traits<char>, std::__1::allocator<char> >, std::__1::allocator<std::__1::basic_string<char, std::__1::char_traits<char>, std::__1::allocator<char> > > > const&) in libCMakeLib.a(cmBootstrapCommands1.cxx.o)
  408. :info:build       cmFileCommand::HandleUploadCommand(std::__1::vector<std::__1::basic_string<char, std::__1::char_traits<char>, std::__1::allocator<char> >, std::__1::allocator<std::__1::basic_string<char, std::__1::char_traits<char>, std::__1::allocator<char> > > > const&) in libCMakeLib.a(cmBootstrapCommands1.cxx.o)
  409. :info:build       cmCurlSetCAInfo(void*, char const*) in libCMakeLib.a(cmCurl.cxx.o)
  410. :info:build   "_curl_easy_setopt", referenced from:
  411. :info:build       cmFileCommand::HandleDownloadCommand(std::__1::vector<std::__1::basic_string<char, std::__1::char_traits<char>, std::__1::allocator<char> >, std::__1::allocator<std::__1::basic_string<char, std::__1::char_traits<char>, std::__1::allocator<char> > > > const&) in libCMakeLib.a(cmBootstrapCommands1.cxx.o)
  412. :info:build       cmFileCommand::HandleUploadCommand(std::__1::vector<std::__1::basic_string<char, std::__1::char_traits<char>, std::__1::allocator<char> >, std::__1::allocator<std::__1::basic_string<char, std::__1::char_traits<char>, std::__1::allocator<char> > > > const&) in libCMakeLib.a(cmBootstrapCommands1.cxx.o)
  413. :info:build       cmCurlSetCAInfo(void*, char const*) in libCMakeLib.a(cmCurl.cxx.o)
  414. :info:build   "_curl_easy_strerror", referenced from:
  415. :info:build       cmFileCommand::HandleDownloadCommand(std::__1::vector<std::__1::basic_string<char, std::__1::char_traits<char>, std::__1::allocator<char> >, std::__1::allocator<std::__1::basic_string<char, std::__1::char_traits<char>, std::__1::allocator<char> > > > const&) in libCMakeLib.a(cmBootstrapCommands1.cxx.o)
  416. :info:build       cmFileCommand::HandleUploadCommand(std::__1::vector<std::__1::basic_string<char, std::__1::char_traits<char>, std::__1::allocator<char> >, std::__1::allocator<std::__1::basic_string<char, std::__1::char_traits<char>, std::__1::allocator<char> > > > const&) in libCMakeLib.a(cmBootstrapCommands1.cxx.o)
  417. :info:build make[2]: Entering directory `/opt/local/var/macports/build/_opt_local_var_macports_sources_rsync.macports.org_release_tarballs_ports_devel_cmake/cmake/work/cmake-3.3.2'
  418. :info:build cd /opt/local/var/macports/build/_opt_local_var_macports_sources_rsync.macports.org_release_tarballs_ports_devel_cmake/cmake/work/cmake-3.3.2 && /opt/local/var/macports/build/_opt_local_var_macports_sources_rsync.macports.org_release_tarballs_ports_devel_cmake/cmake/work/cmake-3.3.2/Bootstrap.cmk/cmake -E cmake_depends "Unix Makefiles" /opt/local/var/macports/build/_opt_local_var_macports_sources_rsync.macports.org_release_tarballs_ports_devel_cmake/cmake/work/cmake-3.3.2 /opt/local/var/macports/build/_opt_local_var_macports_sources_rsync.macports.org_release_tarballs_ports_devel_cmake/cmake/work/cmake-3.3.2/Tests/CMakeLib /opt/local/var/macports/build/_opt_local_var_macports_sources_rsync.macports.org_release_tarballs_ports_devel_cmake/cmake/work/cmake-3.3.2 /opt/local/var/macports/build/_opt_local_var_macports_sources_rsync.macports.org_release_tarballs_ports_devel_cmake/cmake/work/cmake-3.3.2/Tests/CMakeLib /opt/local/var/macports/build/_opt_local_var_macports_sources_rsync.macports.org_release_tarballs_ports_devel_cmake/cmake/work/cmake-3.3.2/Tests/CMakeLib/CMakeFiles/CMakeLibTests.dir/DependInfo.cmake --color=
  419. :info:build       cmCurlSetCAInfo(void*, char const*) in libCMakeLib.a(cmCurl.cxx.o)
  420. :info:build   "_curl_easy_strerror", referenced from:
  421. :info:build       cmFileCommand::HandleDownloadCommand(std::__1::vector<std::__1::basic_string<char, std::__1::char_traits<char>, std::__1::allocator<char> >, std::__1::allocator<std::__1::basic_string<char, std::__1::char_traits<char>, std::__1::allocator<char> > > > const&) in libCMakeLib.a(cmBootstrapCommands1.cxx.o)
  422. :info:build       cmFileCommand::HandleUploadCommand(std::__1::vector<std::__1::basic_string<char, std::__1::char_traits<char>, std::__1::allocator<char> >, std::__1::allocator<std::__1::basic_string<char, std::__1::char_traits<char>, std::__1::allocator<char> > > > const&) in libCMakeLib.a(cmBootstrapCommands1.cxx.o)
  423. :info:build       cmCurlSetCAInfo(void*, char const*) in libCMakeLib.a(cmCurl.cxx.o)
  424. :info:build   "_curl_global_cleanup", referenced from:
  425. :info:build       cmFileCommand::HandleDownloadCommand(std::__1::vector<std::__1::basic_string<char, std::__1::char_traits<char>, std::__1::allocator<char> >, std::__1::allocator<std::__1::basic_string<char, std::__1::char_traits<char>, std::__1::allocator<char> > > > const&) in libCMakeLib.a(cmBootstrapCommands1.cxx.o)
  426. :info:build       cmFileCommand::HandleUploadCommand(std::__1::vector<std::__1::basic_string<char, std::__1::char_traits<char>, std::__1::allocator<char> >, std::__1::allocator<std::__1::basic_string<char, std::__1::char_traits<char>, std::__1::allocator<char> > > > const&) in libCMakeLib.a(cmBootstrapCommands1.cxx.o)
  427. :info:build   "_curl_global_cleanup", referenced from:
  428. :info:build       cmFileCommand::HandleDownloadCommand(std::__1::vector<std::__1::basic_string<char, std::__1::char_traits<char>, std::__1::allocator<char> >, std::__1::allocator<std::__1::basic_string<char, std::__1::char_traits<char>, std::__1::allocator<char> > > > const&) in libCMakeLib.a(cmBootstrapCommands1.cxx.o)
  429. :info:build       cmFileCommand::HandleUploadCommand(std::__1::vector<std::__1::basic_string<char, std::__1::char_traits<char>, std::__1::allocator<char> >, std::__1::allocator<std::__1::basic_string<char, std::__1::char_traits<char>, std::__1::allocator<char> > > > const&) in libCMakeLib.a(cmBootstrapCommands1.cxx.o)
  430. :info:build ld: warning: ignoring file /Library/Frameworks/libcurl.framework/libcurl, missing required architecture x86_64 in file /Library/Frameworks/libcurl.framework/libcurl (2 slices)
  431. :info:build   "_curl_global_init", referenced from:
  432. :info:build       cmFileCommand::HandleDownloadCommand(std::__1::vector<std::__1::basic_string<char, std::__1::char_traits<char>, std::__1::allocator<char> >, std::__1::allocator<std::__1::basic_string<char, std::__1::char_traits<char>, std::__1::allocator<char> > > > const&) in libCMakeLib.a(cmBootstrapCommands1.cxx.o)
  433. :info:build       cmFileCommand::HandleUploadCommand(std::__1::vector<std::__1::basic_string<char, std::__1::char_traits<char>, std::__1::allocator<char> >, std::__1::allocator<std::__1::basic_string<char, std::__1::char_traits<char>, std::__1::allocator<char> > > > const&) in libCMakeLib.a(cmBootstrapCommands1.cxx.o)
  434. :info:build   "_curl_global_init", referenced from:
  435. :info:build       cmFileCommand::HandleDownloadCommand(std::__1::vector<std::__1::basic_string<char, std::__1::char_traits<char>, std::__1::allocator<char> >, std::__1::allocator<std::__1::basic_string<char, std::__1::char_traits<char>, std::__1::allocator<char> > > > const&) in libCMakeLib.a(cmBootstrapCommands1.cxx.o)
  436. :info:build       cmFileCommand::HandleUploadCommand(std::__1::vector<std::__1::basic_string<char, std::__1::char_traits<char>, std::__1::allocator<char> >, std::__1::allocator<std::__1::basic_string<char, std::__1::char_traits<char>, std::__1::allocator<char> > > > const&) in libCMakeLib.a(cmBootstrapCommands1.cxx.o)
  437. :info:build ld: symbol(s) not found for architecture x86_64
  438. :info:build clang: error: linker command failed with exit code 1 (use -v to see invocation)
  439. :info:build ld: symbol(s) not found for architecture x86_64
  440. :info:build make[2]: *** [bin/cmake] Error 1
  441. :info:build make[2]: Leaving directory `/opt/local/var/macports/build/_opt_local_var_macports_sources_rsync.macports.org_release_tarballs_ports_devel_cmake/cmake/work/cmake-3.3.2'
  442. :info:build make[1]: *** [Source/CMakeFiles/cmake.dir/all] Error 2
  443. :info:build make[1]: *** Waiting for unfinished jobs....
  444. :info:build clang: error: linker command failed with exit code 1 (use -v to see invocation)
  445. :info:build make[2]: *** [bin/ccmake] Error 1
  446. :info:build make[2]: Leaving directory `/opt/local/var/macports/build/_opt_local_var_macports_sources_rsync.macports.org_release_tarballs_ports_devel_cmake/cmake/work/cmake-3.3.2'
  447. :info:build make[1]: *** [Source/CMakeFiles/ccmake.dir/all] Error 2
  448. :info:build make[2]: Leaving directory `/opt/local/var/macports/build/_opt_local_var_macports_sources_rsync.macports.org_release_tarballs_ports_devel_cmake/cmake/work/cmake-3.3.2'
  449. :info:build /Applications/Xcode.app/Contents/Developer/usr/bin/make -f Tests/CMakeLib/CMakeFiles/CMakeLibTests.dir/build.make Tests/CMakeLib/CMakeFiles/CMakeLibTests.dir/build
  450. :info:build make[2]: Entering directory `/opt/local/var/macports/build/_opt_local_var_macports_sources_rsync.macports.org_release_tarballs_ports_devel_cmake/cmake/work/cmake-3.3.2'
  451. :info:build make[2]: Nothing to be done for `Tests/CMakeLib/CMakeFiles/CMakeLibTests.dir/build'.
  452. :info:build make[2]: Leaving directory `/opt/local/var/macports/build/_opt_local_var_macports_sources_rsync.macports.org_release_tarballs_ports_devel_cmake/cmake/work/cmake-3.3.2'
  453. :info:build [ 92%] Built target CMakeLibTests
  454. :info:build Undefined symbols for architecture x86_64:
  455. :info:build   "_curl_easy_cleanup", referenced from:
  456. :info:build       cmFileCommand::HandleDownloadCommand(std::__1::vector<std::__1::basic_string<char, std::__1::char_traits<char>, std::__1::allocator<char> >, std::__1::allocator<std::__1::basic_string<char, std::__1::char_traits<char>, std::__1::allocator<char> > > > const&) in libCMakeLib.a(cmBootstrapCommands1.cxx.o)
  457. :info:build       cmFileCommand::HandleUploadCommand(std::__1::vector<std::__1::basic_string<char, std::__1::char_traits<char>, std::__1::allocator<char> >, std::__1::allocator<std::__1::basic_string<char, std::__1::char_traits<char>, std::__1::allocator<char> > > > const&) in libCMakeLib.a(cmBootstrapCommands1.cxx.o)
  458. :info:build       (anonymous namespace)::cURLEasyGuard::~cURLEasyGuard() in libCMakeLib.a(cmBootstrapCommands1.cxx.o)
  459. :info:build   "_curl_easy_init", referenced from:
  460. :info:build       cmFileCommand::HandleDownloadCommand(std::__1::vector<std::__1::basic_string<char, std::__1::char_traits<char>, std::__1::allocator<char> >, std::__1::allocator<std::__1::basic_string<char, std::__1::char_traits<char>, std::__1::allocator<char> > > > const&) in libCMakeLib.a(cmBootstrapCommands1.cxx.o)
  461. :info:build       cmFileCommand::HandleUploadCommand(std::__1::vector<std::__1::basic_string<char, std::__1::char_traits<char>, std::__1::allocator<char> >, std::__1::allocator<std::__1::basic_string<char, std::__1::char_traits<char>, std::__1::allocator<char> > > > const&) in libCMakeLib.a(cmBootstrapCommands1.cxx.o)
  462. :info:build   "_curl_easy_perform", referenced from:
  463. :info:build       cmFileCommand::HandleDownloadCommand(std::__1::vector<std::__1::basic_string<char, std::__1::char_traits<char>, std::__1::allocator<char> >, std::__1::allocator<std::__1::basic_string<char, std::__1::char_traits<char>, std::__1::allocator<char> > > > const&) in libCMakeLib.a(cmBootstrapCommands1.cxx.o)
  464. :info:build       cmFileCommand::HandleUploadCommand(std::__1::vector<std::__1::basic_string<char, std::__1::char_traits<char>, std::__1::allocator<char> >, std::__1::allocator<std::__1::basic_string<char, std::__1::char_traits<char>, std::__1::allocator<char> > > > const&) in libCMakeLib.a(cmBootstrapCommands1.cxx.o)
  465. :info:build   "_curl_easy_setopt", referenced from:
  466. :info:build       cmFileCommand::HandleDownloadCommand(std::__1::vector<std::__1::basic_string<char, std::__1::char_traits<char>, std::__1::allocator<char> >, std::__1::allocator<std::__1::basic_string<char, std::__1::char_traits<char>, std::__1::allocator<char> > > > const&) in libCMakeLib.a(cmBootstrapCommands1.cxx.o)
  467. :info:build       cmFileCommand::HandleUploadCommand(std::__1::vector<std::__1::basic_string<char, std::__1::char_traits<char>, std::__1::allocator<char> >, std::__1::allocator<std::__1::basic_string<char, std::__1::char_traits<char>, std::__1::allocator<char> > > > const&) in libCMakeLib.a(cmBootstrapCommands1.cxx.o)
  468. :info:build       cmCurlSetCAInfo(void*, char const*) in libCMakeLib.a(cmCurl.cxx.o)
  469. :info:build   "_curl_easy_strerror", referenced from:
  470. :info:build       cmFileCommand::HandleDownloadCommand(std::__1::vector<std::__1::basic_string<char, std::__1::char_traits<char>, std::__1::allocator<char> >, std::__1::allocator<std::__1::basic_string<char, std::__1::char_traits<char>, std::__1::allocator<char> > > > const&) in libCMakeLib.a(cmBootstrapCommands1.cxx.o)
  471. :info:build       cmFileCommand::HandleUploadCommand(std::__1::vector<std::__1::basic_string<char, std::__1::char_traits<char>, std::__1::allocator<char> >, std::__1::allocator<std::__1::basic_string<char, std::__1::char_traits<char>, std::__1::allocator<char> > > > const&) in libCMakeLib.a(cmBootstrapCommands1.cxx.o)
  472. :info:build       cmCurlSetCAInfo(void*, char const*) in libCMakeLib.a(cmCurl.cxx.o)
  473. :info:build   "_curl_global_cleanup", referenced from:
  474. :info:build       cmFileCommand::HandleDownloadCommand(std::__1::vector<std::__1::basic_string<char, std::__1::char_traits<char>, std::__1::allocator<char> >, std::__1::allocator<std::__1::basic_string<char, std::__1::char_traits<char>, std::__1::allocator<char> > > > const&) in libCMakeLib.a(cmBootstrapCommands1.cxx.o)
  475. :info:build       cmFileCommand::HandleUploadCommand(std::__1::vector<std::__1::basic_string<char, std::__1::char_traits<char>, std::__1::allocator<char> >, std::__1::allocator<std::__1::basic_string<char, std::__1::char_traits<char>, std::__1::allocator<char> > > > const&) in libCMakeLib.a(cmBootstrapCommands1.cxx.o)
  476. :info:build   "_curl_global_init", referenced from:
  477. :info:build       cmFileCommand::HandleDownloadCommand(std::__1::vector<std::__1::basic_string<char, std::__1::char_traits<char>, std::__1::allocator<char> >, std::__1::allocator<std::__1::basic_string<char, std::__1::char_traits<char>, std::__1::allocator<char> > > > const&) in libCMakeLib.a(cmBootstrapCommands1.cxx.o)
  478. :info:build       cmFileCommand::HandleUploadCommand(std::__1::vector<std::__1::basic_string<char, std::__1::char_traits<char>, std::__1::allocator<char> >, std::__1::allocator<std::__1::basic_string<char, std::__1::char_traits<char>, std::__1::allocator<char> > > > const&) in libCMakeLib.a(cmBootstrapCommands1.cxx.o)
  479. :info:build ld: symbol(s) not found for architecture x86_64
  480. :info:build clang: error: linker command failed with exit code 1 (use -v to see invocation)
  481. :info:build make[2]: *** [bin/cpack] Error 1
  482. :info:build make[2]: Leaving directory `/opt/local/var/macports/build/_opt_local_var_macports_sources_rsync.macports.org_release_tarballs_ports_devel_cmake/cmake/work/cmake-3.3.2'
  483. :info:build make[1]: *** [Source/CMakeFiles/cpack.dir/all] Error 2
  484. :info:build make[1]: Leaving directory `/opt/local/var/macports/build/_opt_local_var_macports_sources_rsync.macports.org_release_tarballs_ports_devel_cmake/cmake/work/cmake-3.3.2'
  485. :info:build make: *** [all] Error 2
  486. :info:build make: Leaving directory `/opt/local/var/macports/build/_opt_local_var_macports_sources_rsync.macports.org_release_tarballs_ports_devel_cmake/cmake/work/cmake-3.3.2'
  487. :info:build Command failed:  cd "/opt/local/var/macports/build/_opt_local_var_macports_sources_rsync.macports.org_release_tarballs_ports_devel_cmake/cmake/work/cmake-3.3.2" && /usr/bin/make -j4 -w all VERBOSE=ON
  488. :info:build Exit code: 2
  489. :error:build org.macports.build for port cmake returned: command execution failed
  490. :debug:build Error code: CHILDSTATUS 26931 2
  491. :debug:build Backtrace: command execution failed
  492.     while executing
  493. "system -nice 0 $fullcmdstring"
  494.     ("eval" body line 1)
  495.     invoked from within
  496. "eval system $notty $nice \$fullcmdstring"
  497.     invoked from within
  498. "command_exec build"
  499.     (procedure "portbuild::build_main" line 8)
  500.     invoked from within
  501. "portbuild::build_main org.macports.build"
  502.     ("eval" body line 1)
  503.     invoked from within
  504. "eval $procedure $targetname"
  505. :info:build Warning: targets not executed for cmake: org.macports.activate org.macports.build org.macports.destroot org.macports.install
  506. :notice:build Please see the log file for port cmake for details:
  507.     /opt/local/var/macports/logs/_opt_local_var_macports_sources_rsync.macports.org_release_tarballs_ports_devel_cmake/cmake/main.log

Reply to "error"

Here you can reply to the paste above